Bug 44601 - Can't compile basic project for WatchOS3 Target deployment 10 (MTOUCH: error MT3001: Could not AOT the assembly)
Summary: Can't compile basic project for WatchOS3 Target deployment 10 (MTOUCH: error ...
Status: RESOLVED DUPLICATE of bug 44048
Alias: None
Product: iOS
Classification: Xamarin
Component: Tools ()
Version: XI 10.0 (iOS10)
Hardware: Macintosh Mac OS
: Normal normal
Target Milestone: (C9)
Assignee: Bugzilla
URL:
: 44599 ()
Depends on:
Blocks:
 
Reported: 2016-09-21 21:52 UTC by Shay
Modified: 2016-09-22 05:09 UTC (History)
5 users (show)

Tags:
Is this bug a regression?: ---
Last known good build:

Notice (2018-05-24): bugzilla.xamarin.com is now in read-only mode.

Please join us on Visual Studio Developer Community and in the Xamarin and Mono organizations on GitHub to continue tracking issues. Bugzilla will remain available for reference in read-only mode. We will continue to work on open Bugzilla bugs, copy them to the new locations as needed for follow-up, and add the new items under Related Links.

Our sincere thanks to everyone who has contributed on this bug tracker over the years. Thanks also for your understanding as we make these adjustments and improvements for the future.


Please create a new report on Developer Community or GitHub with your current version information, steps to reproduce, and relevant error messages or log files if you are hitting an issue that looks similar to this resolved bug and you do not yet see a matching new report.

Related Links:
Status:
RESOLVED DUPLICATE of bug 44048

Description Shay 2016-09-21 21:52:47 UTC
I am having problems compiling a basic app for WatchOS.
To recreate:
1. Create a new default iOS app (defaults to iOS 10)
2. Add the default WatchOS project (3.0)

Try to compile.

I get the following error:
Could not AOT the assembly (MT3001)

My development enviornment is osX 10.11.6, with Xcode 8 (11246) and Xamarin Studio (6.1, stable, build 5441), Xamarin Android (7.0.0.18), Xamarin iOS (10.0.0.6)
iPhone 5c (iOS 10.0.1), iWatch Series 1 (watchOS 3.0).
Comment 1 Shay 2016-09-22 01:03:26 UTC
Full build output follows:


Rebuilding...

Cleaning Solution: app1 (Debug|iPhone)

Build started 9/21/2016 8:56:52 PM.
__________________________________________________
Project "/Users/shayo/Projects/app1/app1.app1.1Extension/app1.app1.1Extension.csproj" (Clean target(s)):
	
	Target CoreClean:
		Deleting file '/Users/shayo/Projects/app1/app1.app1.1Extension/obj/iPhone/Debug/Xamarin.WatchOS,Version=v1.0.AssemblyAttribute.cs'
		Deleting file '/Users/shayo/Projects/app1/app1.app1.1Extension/obj/iPhone/Debug/actool/_PartialAppManifest.items'
		Deleting file '/Users/shayo/Projects/app1/app1.app1.1Extension/obj/iPhone/Debug/actool/_BundleResourceWithLogicalName.items'
		Deleting file '/Users/shayo/Projects/app1/app1.app1.1Extension/bin/iPhone/Debug/app1app11Extension.dll.mdb'
		Deleting file '/Users/shayo/Projects/app1/app1.app1.1Extension/bin/iPhone/Debug/app1app11Extension.dll'
		Deleting file '/Users/shayo/Projects/app1/app1.app1.1Extension/obj/iPhone/Debug/app1app11Extension.dll'
		Deleting file '/Users/shayo/Projects/app1/app1.app1.1Extension/obj/iPhone/Debug/app1app11Extension.dll.mdb'
		Deleting file '/Users/shayo/Projects/app1/app1.app1.1Extension/obj/iPhone/Debug/app1.app1.1Extension.csproj.FilesWrittenAbsolute.txt'
	
	Target _DetectAppManifest:
		FindItemWithLogicalName Task
		  Items:
		    Info.plist
		    Entitlements.plist
		  LogicalName: Info.plist
		  ProjectDir: /Users/shayo/Projects/app1/app1.app1.1Extension
		  ResourcePrefix: Resources
	
	Target _DetectSdkLocations:
		DetectSdkLocations Task
		  TargetFrameworkIdentifier: Xamarin.WatchOS
		  TargetArchitectures: ARMv7k
		  SdkVersion: 3.0
		  XamarinSdkRoot: /Library/Frameworks/Xamarin.iOS.framework/Versions/Current
		  SdkRoot: /Applications/Xcode.app/Contents/Developer/Platforms/WatchOS.platform/Developer/SDKs/WatchOS3.0.sdk
		  SdkDevPath: /Applications/Xcode.app/Contents/Developer
		  SdkUsrPath: /Applications/Xcode.app/Contents/Developer/usr
		  SdkPlatform: WatchOS
		  SdkIsSimulator: False
	
	Target _DetectSigningIdentity:
		DetectSigningIdentity Task
		  AppBundleName: app1app11Extension
		  AppManifest: Info.plist
		  Keychain: <null>
		  ProvisioningProfile: <null>
		  RequireCodesigning: True
		  SdkPlatform: WatchOS
		  SdkIsSimulator: False
		  SigningKey: iPhone Developer
		Multiple provisioning profiles match the bundle identifier; using the first match.
		  1. Provisioning Profile: "iOS Team Provisioning Profile: com.climbtag2.*" (f18b574e-5677-4033-b080-d1460c95f93c)
		     Signing Identity: "iPhone Developer: Shay Ohayon (BNUF3T2N2X)"
		  2. Provisioning Profile: "ShayDevProvisionProfile" (646796d2-64aa-4211-b8ef-beac977e31d1)
		     Signing Identity: "iPhone Developer: Shay Ohayon (BNUF3T2N2X)"
		  3. Provisioning Profile: "ShayDevProvisionProfile" (6e878fbd-b19f-484c-8350-377703f21ab3)
		     Signing Identity: "iPhone Developer: Shay Ohayon (BNUF3T2N2X)"
		Detected signing identity:
		  Code Signing Key: "iPhone Developer: Shay Ohayon (BNUF3T2N2X)" (4DB98CD903C13B98B53228B1065920B97B0986FB)
		  Provisioning Profile: "iOS Team Provisioning Profile: com.climbtag2.*" (f18b574e-5677-4033-b080-d1460c95f93c)
		  Bundle Id: com.climbtag2.app1.watchkitapp.watchkitextension
		  App Id: 8HG6W8XY26.com.climbtag2.app1.watchkitapp.watchkitextension
Done building project "/Users/shayo/Projects/app1/app1.app1.1Extension/app1.app1.1Extension.csproj".

Build succeeded.
	 0 Warning(s)
	 0 Error(s)

Time Elapsed 00:00:00.1359680

Build started 9/21/2016 8:56:52 PM.
__________________________________________________
Build succeeded.
	 0 Warning(s)
	 0 Error(s)

Time Elapsed 00:00:00.0944540

Build started 9/21/2016 8:56:52 PM.
__________________________________________________
Project "/Users/shayo/Projects/app1/app1/app1.csproj" (Clean target(s)):
	
	Target _ComputeTargetArchitectures:
		ParseDeviceSpecificBuildInformation Task
		  Architectures: ARMv7, ARM64
		  IntermediateOutputPath: obj/iPhone/Debug/
		  OutputPath: bin/iPhone/Debug/
		  TargetFrameworkIdentifier: Xamarin.iOS
		  TargetiOSDevice: <?xml version="1.0" encoding="UTF-8"?>
<!DOCTYPE plist PUBLIC "-//Apple//DTD PLIST 1.0//EN" "http://www.apple.com/DTDs/PropertyList-1.0.dtd">
<plist version="1.0">
<dict>
	<key>device</key>
	<dict>
		<key>architecture</key>
		<string>ARMv6, ARMv7, ARMv7s</string>
		<key>model</key>
		<string>iPhone5,3</string>
		<key>os</key>
		<string>iOS</string>
		<key>os-version</key>
		<string>10.0.1</string>
	</dict>
</dict>
</plist>

Done building project "/Users/shayo/Projects/app1/app1/app1.csproj".

Build succeeded.
	 0 Warning(s)
	 0 Error(s)

Time Elapsed 00:00:00.0670740

Building Solution: app1 (Debug|iPhone)

Build started 9/21/2016 8:56:53 PM.
__________________________________________________
Project "/Users/shayo/Projects/app1/app1.app1.1Extension/app1.app1.1Extension.csproj" (Build target(s)):
	
	Target _DetectAppManifest:
		FindItemWithLogicalName Task
		  Items:
		    Info.plist
		    Entitlements.plist
		  LogicalName: Info.plist
		  ProjectDir: /Users/shayo/Projects/app1/app1.app1.1Extension
		  ResourcePrefix: Resources
	
	Target _DetectSdkLocations:
		DetectSdkLocations Task
		  TargetFrameworkIdentifier: Xamarin.WatchOS
		  TargetArchitectures: ARMv7k
		  SdkVersion: 3.0
		  XamarinSdkRoot: /Library/Frameworks/Xamarin.iOS.framework/Versions/Current
		  SdkRoot: /Applications/Xcode.app/Contents/Developer/Platforms/WatchOS.platform/Developer/SDKs/WatchOS3.0.sdk
		  SdkDevPath: /Applications/Xcode.app/Contents/Developer
		  SdkUsrPath: /Applications/Xcode.app/Contents/Developer/usr
		  SdkPlatform: WatchOS
		  SdkIsSimulator: False
	
	Target _DetectSigningIdentity:
		DetectSigningIdentity Task
		  AppBundleName: app1app11Extension
		  AppManifest: Info.plist
		  Keychain: <null>
		  ProvisioningProfile: <null>
		  RequireCodesigning: True
		  SdkPlatform: WatchOS
		  SdkIsSimulator: False
		  SigningKey: iPhone Developer
		Multiple provisioning profiles match the bundle identifier; using the first match.
		  1. Provisioning Profile: "iOS Team Provisioning Profile: com.climbtag2.*" (f18b574e-5677-4033-b080-d1460c95f93c)
		     Signing Identity: "iPhone Developer: Shay Ohayon (BNUF3T2N2X)"
		  2. Provisioning Profile: "ShayDevProvisionProfile" (646796d2-64aa-4211-b8ef-beac977e31d1)
		     Signing Identity: "iPhone Developer: Shay Ohayon (BNUF3T2N2X)"
		  3. Provisioning Profile: "ShayDevProvisionProfile" (6e878fbd-b19f-484c-8350-377703f21ab3)
		     Signing Identity: "iPhone Developer: Shay Ohayon (BNUF3T2N2X)"
		Detected signing identity:
		  Code Signing Key: "iPhone Developer: Shay Ohayon (BNUF3T2N2X)" (4DB98CD903C13B98B53228B1065920B97B0986FB)
		  Provisioning Profile: "iOS Team Provisioning Profile: com.climbtag2.*" (f18b574e-5677-4033-b080-d1460c95f93c)
		  Bundle Id: com.climbtag2.app1.watchkitapp.watchkitextension
		  App Id: 8HG6W8XY26.com.climbtag2.app1.watchkitapp.watchkitextension
	
	Target PrepareForBuild:
		Configuration: Debug Platform: iPhone
		Created directory "obj/iPhone/Debug/"
	
	Target _BeforeCoreCompileInterfaceDefinitions:
	No input files were specified for target _BeforeCoreCompileInterfaceDefinitions, skipping.
	
	Target _CoreCompileInterfaceDefinitions:
	No input files were specified for target _CoreCompileInterfaceDefinitions, skipping.
	
	Target _CoreCompileImageAssets:
		ACTool Task
		  AppManifest: Info.plist
		  DeviceModel: <null>
		  DeviceOSVersion: <null>
		  ImageAssets:
		    Assets.xcassets/Contents.json
		  IntermediateOutputPath: obj/iPhone/Debug/
		  IsWatchApp: False
		  OptimizePNGs: True
		  OutputPath: bin/iPhone/Debug/
		  ProjectDir: /Users/shayo/Projects/app1/app1.app1.1Extension
		  ResourcePrefix: Resources
		  SdkBinPath: /Applications/Xcode.app/Contents/Developer/usr/bin
		  SdkPlatform: WatchOS
		  SdkVersion: 3.0
		Tool /Applications/Xcode.app/Contents/Developer/usr/bin/actool execution started with arguments: --errors --warnings --notices --output-format xml1 --compress-pngs --target-device iphone --target-device ipad --target-device watch --minimum-deployment-target 3.0 --platform watchos --compile /Users/shayo/Projects/app1/app1.app1.1Extension/obj/iPhone/Debug/actool/bundle /Users/shayo/Projects/app1/app1.app1.1Extension/Assets.xcassets
	
	Target _CollectColladaAssets:
		CollectBundleResources Task
		  BundleResources: <null>
		  OptimizePropertyLists: False
		  OptimizePNGs: False
		  ProjectDir: /Users/shayo/Projects/app1/app1.app1.1Extension
		  ResourcePrefix: Resources
	
	Target _CoreCompileColladaAssets:
	No input files were specified for target _CoreCompileColladaAssets, skipping.
	
	Target _BeforeCoreCompileSceneKitAssets:
	No input files were specified for target _BeforeCoreCompileSceneKitAssets, skipping.
	
	Target _CoreCompileSceneKitAssets:
	No input files were specified for target _CoreCompileSceneKitAssets, skipping.
	
	Target _BeforeCompileTextureAtlases:
	No input files were specified for target _BeforeCompileTextureAtlases, skipping.
	
	Target _CoreCompileTextureAtlases:
	No input files were specified for target _CoreCompileTextureAtlases, skipping.
	
	Target _CollectBundleResources:
		CollectBundleResources Task
		  BundleResources:
		    PushNotificationPayload.json
		  OptimizePropertyLists: True
		  OptimizePNGs: True
		  ProjectDir: /Users/shayo/Projects/app1/app1.app1.1Extension
		  ResourcePrefix: Resources
	
	Target _CoreOptimizePngImages:
	No output files were specified for target _CoreOptimizePngImages, skipping.
	
	Target _CoreOptimizePropertyLists:
	No input files were specified for target _CoreOptimizePropertyLists, skipping.
	
	Target _CoreOptimizeLocalizationFiles:
	No input files were specified for target _CoreOptimizeLocalizationFiles, skipping.
	
	Target _UnpackLibraryResources:
		UnpackLibraryResources Task
		  Prefix: monotouch
		  IntermediateOutputPath: obj/iPhone/Debug/
		  NoOverwrite:
		    PushNotificationPayload.json
		  ReferencedLibraries:
		    /Library/Frameworks/Xamarin.iOS.framework/Versions/Current/lib/mono/Xamarin.WatchOS/System.dll
		    /Library/Frameworks/Xamarin.iOS.framework/Versions/Current/lib/mono/Xamarin.WatchOS/System.Xml.dll
		    /Library/Frameworks/Xamarin.iOS.framework/Versions/Current/lib/mono/Xamarin.WatchOS/System.Core.dll
		    /Library/Frameworks/Xamarin.iOS.framework/Versions/Current/lib/mono/Xamarin.WatchOS/Xamarin.WatchOS.dll
		    /Library/Frameworks/Xamarin.iOS.framework/Versions/Current/lib/mono/Xamarin.WatchOS//mscorlib.dll
	
	Target GenerateSatelliteAssemblies:
	No input files were specified for target GenerateSatelliteAssemblies, skipping.
	
	Target CoreCompile:
		Tool /Library/Frameworks/Mono.framework/Versions/4.6.0/lib/mono/4.5/mcs.exe execution started with arguments: /noconfig /debug:full /debug+ /optimize- /out:obj/iPhone/Debug/app1app11Extension.dll ExtensionDelegate.cs GlanceController.cs GlanceController.designer.cs InterfaceController.cs InterfaceController.designer.cs NotificationController.cs NotificationController.designer.cs obj/iPhone/Debug/Xamarin.WatchOS,Version=v1.0.AssemblyAttribute.cs /target:library /define:"__UNIFIED__;__MOBILE__;__WATCHOS__;DEBUG" /nostdlib /reference:/Library/Frameworks/Xamarin.iOS.framework/Versions/Current/lib/mono/Xamarin.WatchOS/System.dll /reference:/Library/Frameworks/Xamarin.iOS.framework/Versions/Current/lib/mono/Xamarin.WatchOS/System.Xml.dll /reference:/Library/Frameworks/Xamarin.iOS.framework/Versions/Current/lib/mono/Xamarin.WatchOS/System.Core.dll /reference:/Library/Frameworks/Xamarin.iOS.framework/Versions/Current/lib/mono/Xamarin.WatchOS/Xamarin.WatchOS.dll /reference:/Library/Frameworks/Xamarin.iOS.framework/Versions/Current/lib/mono/Xamarin.WatchOS//mscorlib.dll /warn:4
	
	Target DeployOutputFiles:
		Copying file from '/Users/shayo/Projects/app1/app1.app1.1Extension/obj/iPhone/Debug/app1app11Extension.dll.mdb' to '/Users/shayo/Projects/app1/app1.app1.1Extension/bin/iPhone/Debug/app1app11Extension.dll.mdb'
		Copying file from '/Users/shayo/Projects/app1/app1.app1.1Extension/obj/iPhone/Debug/app1app11Extension.dll' to '/Users/shayo/Projects/app1/app1.app1.1Extension/bin/iPhone/Debug/app1app11Extension.dll'
	
	Target _ComputeBundleResourceOutputPaths:
		ComputeBundleResourceOutputPaths Task
		  AppBundleDir: bin/iPhone/Debug/app1app11Extension.appex
		  BundleIdentifier: com.climbtag2.app1.watchkitapp.watchkitextension
		  BundleResources:
		    PushNotificationPayload.json
		  IntermediateOutputPath: obj/iPhone/Debug/
		  OutputPath: bin/iPhone/Debug/
	
	Target _CopyResourcesToBundle:
		SmartCopy Task
		  DestinationFiles:
		    bin/iPhone/Debug/app1app11Extension.appex/PushNotificationPayload.json
		  DestinationFolder: 
		  SourceFiles:
		    PushNotificationPayload.json
		Creating directory '/Users/shayo/Projects/app1/app1.app1.1Extension/bin/iPhone/Debug/app1app11Extension.appex'
		Copying file from '/Users/shayo/Projects/app1/app1.app1.1Extension/PushNotificationPayload.json' to '/Users/shayo/Projects/app1/app1.app1.1Extension/bin/iPhone/Debug/app1app11Extension.appex/PushNotificationPayload.json'
	
	Target _CreateAssetPackManifest:
		CreateAssetPackManifest Task
		  AppBundleDir: bin/iPhone/Debug/app1app11Extension.appex
		  InitialInstallTags: <null>
		  OutputPath: bin/iPhone/Debug/
		  PrefetchOrder: <null>
	
	Target _CompileEntitlements:
		CompileEntitlements Task
		  AppBundleDir: bin/iPhone/Debug/app1app11Extension.appex
		  AppIdentifier: 8HG6W8XY26.com.climbtag2.app1.watchkitapp.watchkitextension
		  BundleIdentifier: com.climbtag2.app1.watchkitapp.watchkitextension
		  CompiledEntitlements: obj/iPhone/Debug/Entitlements.xcent
		  Entitlements: Entitlements.plist
		  IsAppExtension: True
		  ProvisioningProfile: f18b574e-5677-4033-b080-d1460c95f93c
		  SdkVersion: 3.0
	
	Target _DetectDebugNetworkConfiguration:
		DetectDebugNetworkConfiguration Task
		  DebugOverWiFi: True
		  DebuggerHosts: <null>
		  SdkIsSimulator: False
		  DebugIPAddresses: 192.168.0.4
	
	Target _CompileAppManifest:
		CompileAppManifest Task
		  AppBundleName: app1app11Extension
		  AppBundleDir: bin/iPhone/Debug/app1app11Extension.appex
		  AppManifest: Info.plist
		  Architecture: ARMv7k
		  AssemblyName: app1app11Extension
		  BundleIdentifier: com.climbtag2.app1.watchkitapp.watchkitextension
		  Debug: True
		  DebugIPAddresses: 192.168.0.4
		  DefaultSdkVersion: 3.0
		  IsAppExtension: True
		  IsWatchApp: False
		  IsWatchExtension: True
		  PartialAppManifests: <null>
		  ResourceRules: <null>
		  SdkPlatform: WatchOS
		  SdkIsSimulator: False
		  TargetFrameworkIdentifier: Xamarin.WatchOS
	
	Target _GetNativeExecutableName:
		GetNativeExecutableName Task
		  AppManifest: bin/iPhone/Debug/app1app11Extension.appex/Info.plist
	
	Target _CompileToNative:
		MTouch Task
		  AppBundleDir: bin/iPhone/Debug/app1app11Extension.appex
		  AppExtensionReferences:
		  AppManifest: bin/iPhone/Debug/app1app11Extension.appex/Info.plist
		  Architectures: ARMv7k
		  ArchiveSymbols: <null>
		  BitcodeEnabled: False
		  CompiledEntitlements: obj/iPhone/Debug/Entitlements.xcent
		  Debug: True
		  EnableGenericValueTypeSharing: True
		  Entitlements: Entitlements.plist
		  ExecutableName: app1app11Extension
		  ExtraArgs: -v -v -v -v
		  FastDev: True
		  HttpClientHandler: HttpClientHandler
		  I18n: <null>
		  IntermediateOutputPath: obj/iPhone/Debug/mtouch-cache
		  IsAppExtension: True
		  LinkerDumpDependencies: False
		  LinkMode: SdkOnly
		  MainAssembly: /Users/shayo/Projects/app1/app1.app1.1Extension/bin/iPhone/Debug//app1app11Extension.dll
		  NativeReferences: <null>
		  OutputPath: bin/iPhone/Debug/
		  Profiling: False
		  ProjectDir: /Users/shayo/Projects/app1/app1.app1.1Extension
		  References:
		    /Library/Frameworks/Xamarin.iOS.framework/Versions/Current/lib/mono/Xamarin.WatchOS/System.dll
		    /Library/Frameworks/Xamarin.iOS.framework/Versions/Current/lib/mono/Xamarin.WatchOS/System.Xml.dll
		    /Library/Frameworks/Xamarin.iOS.framework/Versions/Current/lib/mono/Xamarin.WatchOS/System.Core.dll
		    /Library/Frameworks/Xamarin.iOS.framework/Versions/Current/lib/mono/Xamarin.WatchOS/Xamarin.WatchOS.dll
		    /Library/Frameworks/Xamarin.iOS.framework/Versions/Current/lib/mono/Xamarin.WatchOS//mscorlib.dll
		  SdkIsSimulator: False
		  SdkRoot: /Applications/Xcode.app/Contents/Developer
		  SdkVersion: 3.0
		  SymbolsList: obj/iPhone/Debug/mtouch-symbols.list
		  TargetFrameworkIdentifier: Xamarin.WatchOS
		  TLSProvider: Default
		  UseFloat32: True
		  UseLlvm: False
		  UseThumb: False
		  Verbosity: 2
		Tool /Library/Frameworks/Xamarin.iOS.framework/Versions/Current/bin/mtouch execution started with arguments: --cache /Users/shayo/Projects/app1/app1.app1.1Extension/obj/iPhone/Debug/mtouch-cache --dev /Users/shayo/Projects/app1/app1.app1.1Extension/bin/iPhone/Debug/app1app11Extension.appex --executable app1app11Extension --extension --fastdev --debug --linksdkonly --sdkroot /Applications/Xcode.app/Contents/Developer --sdk 3.0 --targetver 3.0 --aot-options=-O=float32 --http-message-handler=HttpClientHandler --tls-provider=default --abi=armv7k --symbollist /Users/shayo/Projects/app1/app1.app1.1Extension/obj/iPhone/Debug/mtouch-symbols.list --dsym=no -v -v -v -v -r /Library/Frameworks/Xamarin.iOS.framework/Versions/Current/lib/mono/Xamarin.WatchOS/System.dll -r /Library/Frameworks/Xamarin.iOS.framework/Versions/Current/lib/mono/Xamarin.WatchOS/System.Xml.dll -r /Library/Frameworks/Xamarin.iOS.framework/Versions/Current/lib/mono/Xamarin.WatchOS/System.Core.dll -r /Library/Frameworks/Xamarin.iOS.framework/Versions/Current/lib/mono/Xamarin.WatchOS/Xamarin.WatchOS.dll -r /Library/Frameworks/Xamarin.iOS.framework/Versions/Current/lib/mono/Xamarin.WatchOS/mscorlib.dll --target-framework Xamarin.WatchOS,v1.0 /Users/shayo/Projects/app1/app1.app1.1Extension/bin/iPhone/Debug//app1app11Extension.dll 
		Using Xcode 8.0 found in /Applications/Xcode.app/Contents/Developer
		Xamarin.iOS 10.0.0.6 (xcode8: 6c3fee4) using framework: /Applications/Xcode.app/Contents/Developer/Platforms/WatchOS.platform/Developer/SDKs/WatchOS3.0.sdk
		A full rebuild will be performed because the cache is either incomplete or entirely missing.
		Copied /Users/shayo/Projects/app1/app1.app1.1Extension/bin/iPhone/Debug/app1app11Extension.dll to /Users/shayo/Projects/app1/app1.app1.1Extension/obj/iPhone/Debug/mtouch-cache/Link/app1app11Extension.dll
		Copied /Users/shayo/Projects/app1/app1.app1.1Extension/bin/iPhone/Debug/app1app11Extension.dll.mdb to /Users/shayo/Projects/app1/app1.app1.1Extension/obj/iPhone/Debug/mtouch-cache/Link/app1app11Extension.dll.mdb
		Copied /Library/Frameworks/Xamarin.iOS.framework/Versions/10.0.0.6/lib/32bits/Xamarin.WatchOS.dll to /Users/shayo/Projects/app1/app1.app1.1Extension/obj/iPhone/Debug/mtouch-cache/Link/Xamarin.WatchOS.dll
		Copied /Library/Frameworks/Xamarin.iOS.framework/Versions/10.0.0.6/lib/32bits/Xamarin.WatchOS.dll.mdb to /Users/shayo/Projects/app1/app1.app1.1Extension/obj/iPhone/Debug/mtouch-cache/Link/Xamarin.WatchOS.dll.mdb
		Copied /Library/Frameworks/Xamarin.iOS.framework/Versions/10.0.0.6/lib/mono/Xamarin.WatchOS/mscorlib.dll to /Users/shayo/Projects/app1/app1.app1.1Extension/obj/iPhone/Debug/mtouch-cache/Link/mscorlib.dll
		Copied /Library/Frameworks/Xamarin.iOS.framework/Versions/10.0.0.6/lib/mono/Xamarin.WatchOS/mscorlib.dll.mdb to /Users/shayo/Projects/app1/app1.app1.1Extension/obj/iPhone/Debug/mtouch-cache/Link/mscorlib.dll.mdb
		Copied /Library/Frameworks/Xamarin.iOS.framework/Versions/10.0.0.6/lib/mono/Xamarin.WatchOS/System.dll to /Users/shayo/Projects/app1/app1.app1.1Extension/obj/iPhone/Debug/mtouch-cache/Link/System.dll
		Copied /Library/Frameworks/Xamarin.iOS.framework/Versions/10.0.0.6/lib/mono/Xamarin.WatchOS/System.dll.mdb to /Users/shayo/Projects/app1/app1.app1.1Extension/obj/iPhone/Debug/mtouch-cache/Link/System.dll.mdb
		Copied /Library/Frameworks/Xamarin.iOS.framework/Versions/10.0.0.6/lib/mono/Xamarin.WatchOS/System.Xml.dll to /Users/shayo/Projects/app1/app1.app1.1Extension/obj/iPhone/Debug/mtouch-cache/Link/System.Xml.dll
		Copied /Library/Frameworks/Xamarin.iOS.framework/Versions/10.0.0.6/lib/mono/Xamarin.WatchOS/System.Xml.dll.mdb to /Users/shayo/Projects/app1/app1.app1.1Extension/obj/iPhone/Debug/mtouch-cache/Link/System.Xml.dll.mdb
		Copied /Library/Frameworks/Xamarin.iOS.framework/Versions/10.0.0.6/lib/mono/Xamarin.WatchOS/System.Core.dll to /Users/shayo/Projects/app1/app1.app1.1Extension/obj/iPhone/Debug/mtouch-cache/Link/System.Core.dll
		Copied /Library/Frameworks/Xamarin.iOS.framework/Versions/10.0.0.6/lib/mono/Xamarin.WatchOS/System.Core.dll.mdb to /Users/shayo/Projects/app1/app1.app1.1Extension/obj/iPhone/Debug/mtouch-cache/Link/System.Core.dll.mdb
		Copied /Library/Frameworks/Xamarin.iOS.framework/Versions/10.0.0.6/lib/mono/Xamarin.WatchOS/Mono.Dynamic.Interpreter.dll to /Users/shayo/Projects/app1/app1.app1.1Extension/obj/iPhone/Debug/mtouch-cache/Link/Mono.Dynamic.Interpreter.dll
		Copied /Library/Frameworks/Xamarin.iOS.framework/Versions/10.0.0.6/lib/mono/Xamarin.WatchOS/Mono.Dynamic.Interpreter.dll.mdb to /Users/shayo/Projects/app1/app1.app1.1Extension/obj/iPhone/Debug/mtouch-cache/Link/Mono.Dynamic.Interpreter.dll.mdb
		Loaded '/Users/shayo/Projects/app1/app1.app1.1Extension/obj/iPhone/Debug/mtouch-cache/Link/app1app11Extension.dll'
		Loaded '/Users/shayo/Projects/app1/app1.app1.1Extension/obj/iPhone/Debug/mtouch-cache/Link/Xamarin.WatchOS.dll'
		Loaded '/Users/shayo/Projects/app1/app1.app1.1Extension/obj/iPhone/Debug/mtouch-cache/Link/mscorlib.dll'
		Loaded '/Users/shayo/Projects/app1/app1.app1.1Extension/obj/iPhone/Debug/mtouch-cache/Link/System.dll'
		Loaded '/Users/shayo/Projects/app1/app1.app1.1Extension/obj/iPhone/Debug/mtouch-cache/Link/System.Xml.dll'
		Loaded '/Users/shayo/Projects/app1/app1.app1.1Extension/obj/iPhone/Debug/mtouch-cache/Link/System.Core.dll'
		Loaded '/Users/shayo/Projects/app1/app1.app1.1Extension/obj/iPhone/Debug/mtouch-cache/Link/Mono.Dynamic.Interpreter.dll'
		Linking /Users/shayo/Projects/app1/app1.app1.1Extension/bin/iPhone/Debug//app1app11Extension.dll into /Users/shayo/Projects/app1/app1.app1.1Extension/obj/iPhone/Debug/mtouch-cache/PreBuild using mode 'SDKOnly'
		File '/Users/shayo/Projects/app1/app1.app1.1Extension/obj/iPhone/Debug/mtouch-cache/pinvokes.h' does not exist, creating it.
		File '/Users/shayo/Projects/app1/app1.app1.1Extension/obj/iPhone/Debug/mtouch-cache/pinvokes.m' does not exist, creating it.
		Copied /Users/shayo/Projects/app1/app1.app1.1Extension/obj/iPhone/Debug/mtouch-cache/PreBuild/app1app11Extension.dll to /Users/shayo/Projects/app1/app1.app1.1Extension/obj/iPhone/Debug/mtouch-cache/Build/app1app11Extension.dll
		Copied /Users/shayo/Projects/app1/app1.app1.1Extension/obj/iPhone/Debug/mtouch-cache/PreBuild/app1app11Extension.dll.mdb to /Users/shayo/Projects/app1/app1.app1.1Extension/obj/iPhone/Debug/mtouch-cache/Build/app1app11Extension.dll.mdb
		Copied /Users/shayo/Projects/app1/app1.app1.1Extension/obj/iPhone/Debug/mtouch-cache/PreBuild/Xamarin.WatchOS.dll to /Users/shayo/Projects/app1/app1.app1.1Extension/obj/iPhone/Debug/mtouch-cache/Build/Xamarin.WatchOS.dll
		Copied /Users/shayo/Projects/app1/app1.app1.1Extension/obj/iPhone/Debug/mtouch-cache/PreBuild/Xamarin.WatchOS.dll.mdb to /Users/shayo/Projects/app1/app1.app1.1Extension/obj/iPhone/Debug/mtouch-cache/Build/Xamarin.WatchOS.dll.mdb
		Copied /Users/shayo/Projects/app1/app1.app1.1Extension/obj/iPhone/Debug/mtouch-cache/PreBuild/mscorlib.dll to /Users/shayo/Projects/app1/app1.app1.1Extension/obj/iPhone/Debug/mtouch-cache/Build/mscorlib.dll
		Copied /Users/shayo/Projects/app1/app1.app1.1Extension/obj/iPhone/Debug/mtouch-cache/PreBuild/mscorlib.dll.mdb to /Users/shayo/Projects/app1/app1.app1.1Extension/obj/iPhone/Debug/mtouch-cache/Build/mscorlib.dll.mdb
		Copied /Users/shayo/Projects/app1/app1.app1.1Extension/obj/iPhone/Debug/mtouch-cache/PreBuild/System.dll to /Users/shayo/Projects/app1/app1.app1.1Extension/obj/iPhone/Debug/mtouch-cache/Build/System.dll
		Copied /Users/shayo/Projects/app1/app1.app1.1Extension/obj/iPhone/Debug/mtouch-cache/PreBuild/System.dll.mdb to /Users/shayo/Projects/app1/app1.app1.1Extension/obj/iPhone/Debug/mtouch-cache/Build/System.dll.mdb
		Linking with the framework Foundation because it's referenced by a module reference in Xamarin.WatchOS.dll
		Target /Users/shayo/Projects/app1/app1.app1.1Extension/obj/iPhone/Debug/mtouch-cache/app1app11Extension.dll.armv7k.s needs to be rebuilt.
		Aot compiler: /Library/Frameworks/Xamarin.iOS.framework/Versions/10.0.0.6/bin/armv7k-unknown-darwin-mono-sgen --debug -O=gsharedvt -O=float32  --aot=mtriple=armv7k-ios,data-outfile=/Users/shayo/Projects/app1/app1.app1.1Extension/obj/iPhone/Debug/mtouch-cache/app1app11Extension.armv7k.aotdata,static,asmonly,direct-icalls,full,soft-debug,dwarfdebug,no-direct-calls,direct-pinvoke,outfile=/Users/shayo/Projects/app1/app1.app1.1Extension/obj/iPhone/Debug/mtouch-cache/app1app11Extension.dll.armv7k.s "/Users/shayo/Projects/app1/app1.app1.1Extension/obj/iPhone/Debug/mtouch-cache/Build/app1app11Extension.dll"
		Target /Users/shayo/Projects/app1/app1.app1.1Extension/obj/iPhone/Debug/mtouch-cache/app1app11Extension.dll.armv7k.dylib needs to be rebuilt.
		Target /Users/shayo/Projects/app1/app1.app1.1Extension/obj/iPhone/Debug/mtouch-cache/Xamarin.WatchOS.dll.armv7k.s needs to be rebuilt.
		Aot compiler: /Library/Frameworks/Xamarin.iOS.framework/Versions/10.0.0.6/bin/armv7k-unknown-darwin-mono-sgen --debug -O=gsharedvt -O=float32  --aot=mtriple=armv7k-ios,data-outfile=/Users/shayo/Projects/app1/app1.app1.1Extension/obj/iPhone/Debug/mtouch-cache/Xamarin.WatchOS.armv7k.aotdata,static,asmonly,direct-icalls,full,dwarfdebug,no-direct-calls,direct-pinvoke,outfile=/Users/shayo/Projects/app1/app1.app1.1Extension/obj/iPhone/Debug/mtouch-cache/Xamarin.WatchOS.dll.armv7k.s "/Users/shayo/Projects/app1/app1.app1.1Extension/obj/iPhone/Debug/mtouch-cache/Build/Xamarin.WatchOS.dll"
		Target /Users/shayo/Projects/app1/app1.app1.1Extension/obj/iPhone/Debug/mtouch-cache/Xamarin.WatchOS.dll.armv7k.dylib needs to be rebuilt.
		Target /Users/shayo/Projects/app1/app1.app1.1Extension/obj/iPhone/Debug/mtouch-cache/mscorlib.dll.armv7k.s needs to be rebuilt.
		Aot compiler: /Library/Frameworks/Xamarin.iOS.framework/Versions/10.0.0.6/bin/armv7k-unknown-darwin-mono-sgen --debug -O=gsharedvt -O=float32  --aot=mtriple=armv7k-ios,data-outfile=/Users/shayo/Projects/app1/app1.app1.1Extension/obj/iPhone/Debug/mtouch-cache/mscorlib.armv7k.aotdata,static,asmonly,direct-icalls,full,dwarfdebug,no-direct-calls,direct-pinvoke,outfile=/Users/shayo/Projects/app1/app1.app1.1Extension/obj/iPhone/Debug/mtouch-cache/mscorlib.dll.armv7k.s "/Users/shayo/Projects/app1/app1.app1.1Extension/obj/iPhone/Debug/mtouch-cache/Build/mscorlib.dll"
		Target /Users/shayo/Projects/app1/app1.app1.1Extension/obj/iPhone/Debug/mtouch-cache/mscorlib.dll.armv7k.dylib needs to be rebuilt.
		Target /Users/shayo/Projects/app1/app1.app1.1Extension/obj/iPhone/Debug/mtouch-cache/System.dll.armv7k.s needs to be rebuilt.
		Aot compiler: /Library/Frameworks/Xamarin.iOS.framework/Versions/10.0.0.6/bin/armv7k-unknown-darwin-mono-sgen --debug -O=gsharedvt -O=float32  --aot=mtriple=armv7k-ios,data-outfile=/Users/shayo/Projects/app1/app1.app1.1Extension/obj/iPhone/Debug/mtouch-cache/System.armv7k.aotdata,static,asmonly,direct-icalls,full,dwarfdebug,no-direct-calls,direct-pinvoke,outfile=/Users/shayo/Projects/app1/app1.app1.1Extension/obj/iPhone/Debug/mtouch-cache/System.dll.armv7k.s "/Users/shayo/Projects/app1/app1.app1.1Extension/obj/iPhone/Debug/mtouch-cache/Build/System.dll"
		Target /Users/shayo/Projects/app1/app1.app1.1Extension/obj/iPhone/Debug/mtouch-cache/System.dll.armv7k.dylib needs to be rebuilt.
		File '/Users/shayo/Projects/app1/app1.app1.1Extension/obj/iPhone/Debug/mtouch-cache/registrar.h' does not exist, creating it.
		File '/Users/shayo/Projects/app1/app1.app1.1Extension/obj/iPhone/Debug/mtouch-cache/registrar.m' does not exist, creating it.
		File '/Users/shayo/Projects/app1/app1.app1.1Extension/obj/iPhone/Debug/mtouch-cache/main.armv7k.m' does not exist, creating it.
		MONO_PATH=/Users/shayo/Projects/app1/app1.app1.1Extension/obj/iPhone/Debug/mtouch-cache/Build /Library/Frameworks/Xamarin.iOS.framework/Versions/10.0.0.6/bin/armv7k-unknown-darwin-mono-sgen --debug -O=gsharedvt -O=float32  --aot=mtriple=armv7k-ios,data-outfile=/Users/shayo/Projects/app1/app1.app1.1Extension/obj/iPhone/Debug/mtouch-cache/app1app11Extension.armv7k.aotdata,static,asmonly,direct-icalls,full,soft-debug,dwarfdebug,no-direct-calls,direct-pinvoke,outfile=/Users/shayo/Projects/app1/app1.app1.1Extension/obj/iPhone/Debug/mtouch-cache/app1app11Extension.dll.armv7k.s "/Users/shayo/Projects/app1/app1.app1.1Extension/obj/iPhone/Debug/mtouch-cache/Build/app1app11Extension.dll"
		MONO_PATH=/Users/shayo/Projects/app1/app1.app1.1Extension/obj/iPhone/Debug/mtouch-cache/Build /Library/Frameworks/Xamarin.iOS.framework/Versions/10.0.0.6/bin/armv7k-unknown-darwin-mono-sgen --debug -O=gsharedvt -O=float32  --aot=mtriple=armv7k-ios,data-outfile=/Users/shayo/Projects/app1/app1.app1.1Extension/obj/iPhone/Debug/mtouch-cache/Xamarin.WatchOS.armv7k.aotdata,static,asmonly,direct-icalls,full,dwarfdebug,no-direct-calls,direct-pinvoke,outfile=/Users/shayo/Projects/app1/app1.app1.1Extension/obj/iPhone/Debug/mtouch-cache/Xamarin.WatchOS.dll.armv7k.s "/Users/shayo/Projects/app1/app1.app1.1Extension/obj/iPhone/Debug/mtouch-cache/Build/Xamarin.WatchOS.dll"
		MONO_PATH=/Users/shayo/Projects/app1/app1.app1.1Extension/obj/iPhone/Debug/mtouch-cache/Build /Library/Frameworks/Xamarin.iOS.framework/Versions/10.0.0.6/bin/armv7k-unknown-darwin-mono-sgen --debug -O=gsharedvt -O=float32  --aot=mtriple=armv7k-ios,data-outfile=/Users/shayo/Projects/app1/app1.app1.1Extension/obj/iPhone/Debug/mtouch-cache/mscorlib.armv7k.aotdata,static,asmonly,direct-icalls,full,dwarfdebug,no-direct-calls,direct-pinvoke,outfile=/Users/shayo/Projects/app1/app1.app1.1Extension/obj/iPhone/Debug/mtouch-cache/mscorlib.dll.armv7k.s "/Users/shayo/Projects/app1/app1.app1.1Extension/obj/iPhone/Debug/mtouch-cache/Build/mscorlib.dll"
		/Applications/Xcode.app/Contents/Developer/Toolchains/XcodeDefault.xctoolchain/usr/bin/clang  -Wno-receiver-forward-class -gdwarf-2 -I/Library/Frameworks/Xamarin.iOS.framework/Versions/10.0.0.6/SDKs/Xamarin.WatchOS.sdk/usr/include -isysroot /Applications/Xcode.app/Contents/Developer/Platforms/WatchOS.platform/Developer/SDKs/WatchOS3.0.sdk -Qunused-arguments -mwatchos-version-min=3.0 -fembed-bitcode-marker -arch armv7k -c -o /Users/shayo/Projects/app1/app1.app1.1Extension/obj/iPhone/Debug/mtouch-cache/pinvokes.armv7k.o -x objective-c++ /Users/shayo/Projects/app1/app1.app1.1Extension/obj/iPhone/Debug/mtouch-cache/pinvokes.m -DDEBUG
		MONO_PATH=/Users/shayo/Projects/app1/app1.app1.1Extension/obj/iPhone/Debug/mtouch-cache/Build /Library/Frameworks/Xamarin.iOS.framework/Versions/10.0.0.6/bin/armv7k-unknown-darwin-mono-sgen --debug -O=gsharedvt -O=float32  --aot=mtriple=armv7k-ios,data-outfile=/Users/shayo/Projects/app1/app1.app1.1Extension/obj/iPhone/Debug/mtouch-cache/System.armv7k.aotdata,static,asmonly,direct-icalls,full,dwarfdebug,no-direct-calls,direct-pinvoke,outfile=/Users/shayo/Projects/app1/app1.app1.1Extension/obj/iPhone/Debug/mtouch-cache/System.dll.armv7k.s "/Users/shayo/Projects/app1/app1.app1.1Extension/obj/iPhone/Debug/mtouch-cache/Build/System.dll"
		Mono Ahead of Time compiler - compiling assembly /Users/shayo/Projects/app1/app1.app1.1Extension/obj/iPhone/Debug/mtouch-cache/Build/System.dll
		AOTID 29DD618D-62EB-AF6A-9FA5-656762BAFEEC
		Code: 736(39%) Info: 14(0%) Ex Info: 320(17%) Unwind Info: 167(8%) Class Info: 99(5%) PLT: 7(0%) GOT Info: 421(22%) Offsets: 125(6%) GOT: 92
		Compiled: 4/4 (100%), No GOT slots: 0 (0%), Direct calls: 0 (100%)
		Output file: '/Users/shayo/Projects/app1/app1.app1.1Extension/obj/iPhone/Debug/mtouch-cache/System.dll.armv7k.s'.
		Linking symbol: '_mono_aot_module_System_info'.
		JIT time: 0 ms, Generation time: 0 ms, Assembly+Link time: 0 ms.
		/Users/builder/data/lanes/3426/6c3fee4d/source/xamarin-macios/external/watch-mono/eglib/src/ghashtable.c:549: assertion 'hash != NULL' failed
		
		Mono Ahead of Time compiler - compiling assembly /Users/shayo/Projects/app1/app1.app1.1Extension/obj/iPhone/Debug/mtouch-cache/Build/Xamarin.WatchOS.dll
		AOTID 2EE17F1C-0E8B-C048-BE98-BE56D5631B16
		Code: 329404(64%) Info: 7387(1%) Ex Info: 126316(24%) Unwind Info: 21340(4%) Class Info: 5765(1%) PLT: 853(0%) GOT Info: 14079(2%) Offsets: 5980(1%) GOT: 6648
		Compiled: 1165/1165 (100%), No GOT slots: 0 (0%), Direct calls: 195 (16%)
		Output file: '/Users/shayo/Projects/app1/app1.app1.1Extension/obj/iPhone/Debug/mtouch-cache/Xamarin.WatchOS.dll.armv7k.s'.
		Linking symbol: '_mono_aot_module_Xamarin_WatchOS_info'.
		JIT time: 140 ms, Generation time: 120 ms, Assembly+Link time: 1 ms.
		
		Mono Ahead of Time compiler - compiling assembly /Users/shayo/Projects/app1/app1.app1.1Extension/obj/iPhone/Debug/mtouch-cache/Build/app1app11Extension.dll
		AOTID DB1DE82E-AC8D-5D8B-C50A-BCCE933A0CCA
		Code: 4540(63%) Info: 84(1%) Ex Info: 1037(14%) Unwind Info: 193(2%) Class Info: 770(10%) PLT: 8(0%) GOT Info: 321(4%) Offsets: 181(2%) GOT: 180
		Compiled: 19/19 (100%), No GOT slots: 0 (0%), Direct calls: 0 (100%)
		Output file: '/Users/shayo/Projects/app1/app1.app1.1Extension/obj/iPhone/Debug/mtouch-cache/app1app11Extension.dll.armv7k.s'.
		Linking symbol: '_mono_aot_module_app1app11Extension_info'.
		JIT time: 1 ms, Generation time: 2 ms, Assembly+Link time: 0 ms.
		/Users/builder/data/lanes/3426/6c3fee4d/source/xamarin-macios/external/watch-mono/eglib/src/ghashtable.c:549: assertion 'hash != NULL' failed
		
		/Applications/Xcode.app/Contents/Developer/Toolchains/XcodeDefault.xctoolchain/usr/bin/clang  -framework Foundation /Library/Frameworks/Xamarin.iOS.framework/Versions/10.0.0.6/SDKs/Xamarin.WatchOS.sdk/usr/lib/libmonosgen-2.0.dylib /Library/Frameworks/Xamarin.iOS.framework/Versions/10.0.0.6/SDKs/Xamarin.WatchOS.sdk/usr/lib/libxamarin-debug.dylib -lz -isysroot /Applications/Xcode.app/Contents/Developer/Platforms/WatchOS.platform/Developer/SDKs/WatchOS3.0.sdk -Qunused-arguments -mwatchos-version-min=3.0 -fembed-bitcode-marker -arch armv7k -shared -install_name @executable_path/libSystem.dll.dylib -fapplication-extension -o /Users/shayo/Projects/app1/app1.app1.1Extension/obj/iPhone/Debug/mtouch-cache/System.dll.armv7k.dylib -x assembler /Users/shayo/Projects/app1/app1.app1.1Extension/obj/iPhone/Debug/mtouch-cache/System.dll.armv7k.s -DDEBUG
		/Applications/Xcode.app/Contents/Developer/Toolchains/XcodeDefault.xctoolchain/usr/bin/clang  -framework Foundation /Library/Frameworks/Xamarin.iOS.framework/Versions/10.0.0.6/SDKs/Xamarin.WatchOS.sdk/usr/lib/libmonosgen-2.0.dylib /Library/Frameworks/Xamarin.iOS.framework/Versions/10.0.0.6/SDKs/Xamarin.WatchOS.sdk/usr/lib/libxamarin-debug.dylib -lz -isysroot /Applications/Xcode.app/Contents/Developer/Platforms/WatchOS.platform/Developer/SDKs/WatchOS3.0.sdk -Qunused-arguments -mwatchos-version-min=3.0 -fembed-bitcode-marker -arch armv7k -shared -install_name @executable_path/libapp1app11Extension.dll.dylib -fapplication-extension -o /Users/shayo/Projects/app1/app1.app1.1Extension/obj/iPhone/Debug/mtouch-cache/app1app11Extension.dll.armv7k.dylib -x assembler /Users/shayo/Projects/app1/app1.app1.1Extension/obj/iPhone/Debug/mtouch-cache/app1app11Extension.dll.armv7k.s -DDEBUG
		/Applications/Xcode.app/Contents/Developer/Toolchains/XcodeDefault.xctoolchain/usr/bin/clang  -framework Foundation /Library/Frameworks/Xamarin.iOS.framework/Versions/10.0.0.6/SDKs/Xamarin.WatchOS.sdk/usr/lib/libmonosgen-2.0.dylib /Library/Frameworks/Xamarin.iOS.framework/Versions/10.0.0.6/SDKs/Xamarin.WatchOS.sdk/usr/lib/libxamarin-debug.dylib -lz -isysroot /Applications/Xcode.app/Contents/Developer/Platforms/WatchOS.platform/Developer/SDKs/WatchOS3.0.sdk -Qunused-arguments -mwatchos-version-min=3.0 -fembed-bitcode-marker -arch armv7k -shared -install_name @executable_path/libXamarin.WatchOS.dll.dylib -fapplication-extension -o /Users/shayo/Projects/app1/app1.app1.1Extension/obj/iPhone/Debug/mtouch-cache/Xamarin.WatchOS.dll.armv7k.dylib -x assembler /Users/shayo/Projects/app1/app1.app1.1Extension/obj/iPhone/Debug/mtouch-cache/Xamarin.WatchOS.dll.armv7k.s -DDEBUG
		Process exited with code 1, command:
		/Applications/Xcode.app/Contents/Developer/Toolchains/XcodeDefault.xctoolchain/usr/bin/clang  -Wno-receiver-forward-class -gdwarf-2 -I/Library/Frameworks/Xamarin.iOS.framework/Versions/10.0.0.6/SDKs/Xamarin.WatchOS.sdk/usr/include -isysroot /Applications/Xcode.app/Contents/Developer/Platforms/WatchOS.platform/Developer/SDKs/WatchOS3.0.sdk -Qunused-arguments -mwatchos-version-min=3.0 -fembed-bitcode-marker -arch armv7k -c -o /Users/shayo/Projects/app1/app1.app1.1Extension/obj/iPhone/Debug/mtouch-cache/registrar.armv7k.o -x objective-c++ /Users/shayo/Projects/app1/app1.app1.1Extension/obj/iPhone/Debug/mtouch-cache/registrar.m -DDEBUG
		/Applications/Xcode.app/Contents/Developer/Toolchains/XcodeDefault.xctoolchain/usr/bin/clang  -framework Foundation /Library/Frameworks/Xamarin.iOS.framework/Versions/10.0.0.6/SDKs/Xamarin.WatchOS.sdk/usr/lib/libmonosgen-2.0.dylib /Library/Frameworks/Xamarin.iOS.framework/Versions/10.0.0.6/SDKs/Xamarin.WatchOS.sdk/usr/lib/libxamarin-debug.dylib -lz -isysroot /Applications/Xcode.app/Contents/Developer/Platforms/WatchOS.platform/Developer/SDKs/WatchOS3.0.sdk -Qunused-arguments -mwatchos-version-min=3.0 -fembed-bitcode-marker -arch armv7k -shared -install_name @executable_path/libXamarin.WatchOS.dll.dylib -fapplication-extension -o /Users/shayo/Projects/app1/app1.app1.1Extension/obj/iPhone/Debug/mtouch-cache/Xamarin.WatchOS.dll.armv7k.dylib -x assembler /Users/shayo/Projects/app1/app1.app1.1Extension/obj/iPhone/Debug/mtouch-cache/Xamarin.WatchOS.dll.armv7k.s -DDEBUG
		Undefined symbols for architecture armv7k:
		/Applications/Xcode.app/Contents/Developer/Toolchains/XcodeDefault.xctoolchain/usr/bin/clang  -gdwarf-2 -I/Library/Frameworks/Xamarin.iOS.framework/Versions/10.0.0.6/SDKs/Xamarin.WatchOS.sdk/usr/include -isysroot /Applications/Xcode.app/Contents/Developer/Platforms/WatchOS.platform/Developer/SDKs/WatchOS3.0.sdk -Qunused-arguments -mwatchos-version-min=3.0 -fembed-bitcode-marker -arch armv7k -c -o /Users/shayo/Projects/app1/app1.app1.1Extension/obj/iPhone/Debug/mtouch-cache/main.armv7k.o -x objective-c++ /Users/shayo/Projects/app1/app1.app1.1Extension/obj/iPhone/Debug/mtouch-cache/main.armv7k.m -DMONOTOUCH -DDEBUG
		  "_xamarin_pinvoke_wrapper_IntPtr_objc_msgSend", referenced from:
		      wrapper_managed_to_native_ObjCRuntime_Messaging_IntPtr_objc_msgSend_intptr_intptr in Xamarin-52d683.o
		  "_xamarin_pinvoke_wrapper_IntPtr_objc_msgSendSuper", referenced from:
		      wrapper_managed_to_native_ObjCRuntime_Messaging_IntPtr_objc_msgSendSuper_intptr_intptr in Xamarin-52d683.o
		  "_xamarin_pinvoke_wrapper_IntPtr_objc_msgSendSuper_IntPtr", referenced from:
		      wrapper_managed_to_native_ObjCRuntime_Messaging_IntPtr_objc_msgSendSuper_IntPtr_intptr_intptr_intptr in Xamarin-52d683.o
		  "_xamarin_pinvoke_wrapper_IntPtr_objc_msgSendSuper_IntPtr_IntPtr", referenced from:
		      wrapper_managed_to_native_ObjCRuntime_Messaging_IntPtr_objc_msgSendSuper_IntPtr_IntPtr_intptr_intptr_intptr_intptr in Xamarin-52d683.o
		  "_xamarin_pinvoke_wrapper_IntPtr_objc_msgSendSuper_IntPtr_IntPtr_IntPtr", referenced from:
		      wrapper_managed_to_native_ObjCRuntime_Messaging_IntPtr_objc_msgSendSuper_IntPtr_IntPtr_IntPtr_intptr_intptr_intptr_intptr_intptr in Xamarin-52d683.o
		  "_xamarin_pinvoke_wrapper_IntPtr_objc_msgSend_IntPtr", referenced from:
		      wrapper_managed_to_native_ObjCRuntime_Messaging_IntPtr_objc_msgSend_IntPtr_intptr_intptr_intptr in Xamarin-52d683.o
		  "_xamarin_pinvoke_wrapper_IntPtr_objc_msgSend_IntPtr_IntPtr", referenced from:
		      wrapper_managed_to_native_ObjCRuntime_Messaging_IntPtr_objc_msgSend_IntPtr_IntPtr_intptr_intptr_intptr_intptr in Xamarin-52d683.o
		  "_xamarin_pinvoke_wrapper_IntPtr_objc_msgSend_IntPtr_IntPtr_IntPtr", referenced from:
		      wrapper_managed_to_native_ObjCRuntime_Messaging_IntPtr_objc_msgSend_IntPtr_IntPtr_IntPtr_intptr_intptr_intptr_intptr_intptr in Xamarin-52d683.o
		  "_xamarin_pinvoke_wrapper_IntPtr_objc_msgSend_IntPtr_nint", referenced from:
		      wrapper_managed_to_native_Foundation_NSString_IntPtr_objc_msgSend_IntPtr_nint_intptr_intptr_intptr_System_nint in Xamarin-52d683.o
		  "_xamarin_pinvoke_wrapper_IntPtr_objc_msgSend_nuint", referenced from:
		      wrapper_managed_to_native_ObjCRuntime_Messaging_IntPtr_objc_msgSend_nuint_intptr_intptr_System_nuint in Xamarin-52d683.o
		  "_xamarin_pinvoke_wrapper_bool_objc_msgSend", referenced from:
		      wrapper_managed_to_native_ObjCRuntime_Messaging_bool_objc_msgSend_intptr_intptr in Xamarin-52d683.o
		  "_xamarin_pinvoke_wrapper_bool_objc_msgSendSuper", referenced from:
		      wrapper_managed_to_native_ObjCRuntime_Messaging_bool_objc_msgSendSuper_intptr_intptr in Xamarin-52d683.o
		  "_xamarin_pinvoke_wrapper_bool_objc_msgSendSuper_IntPtr", referenced from:
		      wrapper_managed_to_native_ObjCRuntime_Messaging_bool_objc_msgSendSuper_IntPtr_intptr_intptr_intptr in Xamarin-52d683.o
		  "_xamarin_pinvoke_wrapper_bool_objc_msgSend_IntPtr", referenced from:
		      wrapper_managed_to_native_ObjCRuntime_Messaging_bool_objc_msgSend_IntPtr_intptr_intptr_intptr in Xamarin-52d683.o
		      wrapper_managed_to_native_ObjCRuntime_Runtime_bool_objc_msgSend_IntPtr_intptr_intptr_intptr in Xamarin-52d683.o
		  "_xamarin_pinvoke_wrapper_nuint_objc_msgSend", referenced from:
		      wrapper_managed_to_native_ObjCRuntime_Messaging_nuint_objc_msgSend_intptr_intptr in Xamarin-52d683.o
		  "_xamarin_pinvoke_wrapper_nuint_objc_msgSendSuper", referenced from:
		      wrapper_managed_to_native_ObjCRuntime_Messaging_nuint_objc_msgSendSuper_intptr_intptr in Xamarin-52d683.o
		  "_xamarin_pinvoke_wrapper_objc_msgSend", referenced from:
		      wrapper_managed_to_native_Foundation_NSFastEnumerator_objc_msgSend_intptr_intptr_Foundation_NSFastEnumerationState__intptr___System_nuint in Xamarin-52d683.o
		  "_xamarin_pinvoke_wrapper_void_objc_msgSend", referenced from:
		      wrapper_managed_to_native_ObjCRuntime_Messaging_void_objc_msgSend_intptr_intptr in Xamarin-52d683.o
		  "_xamarin_pinvoke_wrapper_void_objc_msgSendSuper", referenced from:
		      wrapper_managed_to_native_ObjCRuntime_Messaging_void_objc_msgSendSuper_intptr_intptr in Xamarin-52d683.o
		  "_xamarin_pinvoke_wrapper_void_objc_msgSendSuper_IntPtr", referenced from:
		      wrapper_managed_to_native_ObjCRuntime_Messaging_void_objc_msgSendSuper_IntPtr_intptr_intptr_intptr in Xamarin-52d683.o
		  "_xamarin_pinvoke_wrapper_void_objc_msgSend_IntPtr", referenced from:
		      wrapper_managed_to_native_ObjCRuntime_Messaging_void_objc_msgSend_IntPtr_intptr_intptr_intptr in Xamarin-52d683.o
		  "_xamarin_pinvoke_wrapper_void_objc_msgSend_IntPtr_IntPtr_bool", referenced from:
		      wrapper_managed_to_native_ObjCRuntime_Messaging_void_objc_msgSend_IntPtr_IntPtr_bool_intptr_intptr_intptr_intptr_bool in Xamarin-52d683.o
		ld: symbol(s) not found for architecture armv7k
		clang: error: linker command failed with exit code 1 (use -v to see invocation)
		
		Mono Ahead of Time compiler - compiling assembly /Users/shayo/Projects/app1/app1.app1.1Extension/obj/iPhone/Debug/mtouch-cache/Build/mscorlib.dll
		AOTID C736B174-1D07-3F76-7AF3-01D5717F9159
		Code: 1647556(63%) Info: 33420(1%) Ex Info: 684478(26%) Unwind Info: 89240(3%) Class Info: 14951(0%) PLT: 4826(0%) GOT Info: 110644(4%) Offsets: 25914(0%) GOT: 29248
		Compiled: 5620/5620 (100%), No GOT slots: 1 (0%), Direct calls: 2499 (30%)
		Output file: '/Users/shayo/Projects/app1/app1.app1.1Extension/obj/iPhone/Debug/mtouch-cache/mscorlib.dll.armv7k.s'.
		Linking symbol: '_mono_aot_module_mscorlib_info'.
		JIT time: 553 ms, Generation time: 918 ms, Assembly+Link time: 4 ms.
		
		/Applications/Xcode.app/Contents/Developer/Toolchains/XcodeDefault.xctoolchain/usr/bin/clang  -framework Foundation /Library/Frameworks/Xamarin.iOS.framework/Versions/10.0.0.6/SDKs/Xamarin.WatchOS.sdk/usr/lib/libmonosgen-2.0.dylib /Library/Frameworks/Xamarin.iOS.framework/Versions/10.0.0.6/SDKs/Xamarin.WatchOS.sdk/usr/lib/libxamarin-debug.dylib -lz -isysroot /Applications/Xcode.app/Contents/Developer/Platforms/WatchOS.platform/Developer/SDKs/WatchOS3.0.sdk -Qunused-arguments -mwatchos-version-min=3.0 -fembed-bitcode-marker -arch armv7k -shared -install_name @executable_path/libmscorlib.dll.dylib -fapplication-extension -o /Users/shayo/Projects/app1/app1.app1.1Extension/obj/iPhone/Debug/mtouch-cache/mscorlib.dll.armv7k.dylib -x assembler /Users/shayo/Projects/app1/app1.app1.1Extension/obj/iPhone/Debug/mtouch-cache/mscorlib.dll.armv7k.s -DDEBUG
		/Users/shayo/Projects/app1/app1.app1.1Extension/obj/iPhone/Debug/mtouch-cache/main.armv7k.m:47:13: warning: conversion from string literal to 'char *' is deprecated [-Wc++11-compat-deprecated-writable-strings]
		        argv [0] = "app1app11Extension";
		                   ^ 
		1 warning generated.
		
MTOUCH: error MT3001: Could not AOT the assembly '/Users/shayo/Projects/app1/app1.app1.1Extension/obj/iPhone/Debug/mtouch-cache/Build/Xamarin.WatchOS.dll'
		  at Xamarin.Bundler.CompileTask.Build () [0x0002a] in <86a99508958c45bc8a05d21e3b49a458>:0 
		  at Xamarin.Bundler.BuildTask.Execute () [0x00000] in <86a99508958c45bc8a05d21e3b49a458>:0 
		  at Xamarin.Bundler.BuildTasks.Execute (Xamarin.Bundler.BuildTask v) [0x00000] in <86a99508958c45bc8a05d21e3b49a458>:0 
		  at System.Threading.Tasks.Parallel+<ForEachWorker>c__AnonStorey6`2[TSource,TLocal].<>m__0 (System.Int32 i) [0x00012] in <94fd79a3b7144c54b4cb162b50fc7761>:0 
		  at System.Threading.Tasks.Parallel+<ForWorker>c__AnonStorey3`1[TLocal].<>m__1 () [0x000ed] in <94fd79a3b7144c54b4cb162b50fc7761>:0 
	Task "MTouch" execution -- FAILED
	Done building target "_CompileToNative" in project "/Users/shayo/Projects/app1/app1.app1.1Extension/app1.app1.1Extension.csproj".-- FAILED
	
Done building project "/Users/shayo/Projects/app1/app1.app1.1Extension/app1.app1.1Extension.csproj".-- FAILED

Build FAILED.
Errors:

/Users/shayo/Projects/app1/app1.app1.1Extension/app1.app1.1Extension.csproj (Build) ->
/Library/Frameworks/Mono.framework/External/xbuild/Xamarin/iOS/Xamarin.iOS.Common.targets (_CompileToNative target) ->

	MTOUCH: error MT3001: Could not AOT the assembly '/Users/shayo/Projects/app1/app1.app1.1Extension/obj/iPhone/Debug/mtouch-cache/Build/Xamarin.WatchOS.dll'

	 0 Warning(s)
	 1 Error(s)

Time Elapsed 00:00:07.0435760

---------------------- Done ----------------------

Build: 1 error, 0 warnings
Comment 2 Shay 2016-09-22 01:40:11 UTC
FYI: Changing "Link Behavior" to don't link solves the compilation error. However, the app fails to be deployed to the watch:

/Applications/Xamarin Studio.app/Contents/Resources/lib/monodevelop/AddIns/MonoDevelop.IPhone/mlaunch.app/Contents/MacOS/mlaunch -sdkroot "/Applications/Xcode.app/Contents/Developer" -installdev "/Users/shayo/Projects/app1/app1/bin/iPhone/Debug/build-iphone5.3-10.0.1/app1.app" --device watchos,ios "--devname=iPhone5c"
Installing application bundle 'com.climbtag2.app1' on 'iPhone5c'
Application bundle 'com.climbtag2.app1' installed on 'iPhone5c'
Installing application bundle 'com.climbtag2.app1.watchkitapp' on 'Shay’s Apple Watch'

[then it stalls].

Watch is connected properly. No problem uploading apps using xcode.
Comment 3 Sebastien Pouliot 2016-09-22 01:44:23 UTC
Can you try rebuilding with "Enable incremental builds" disabled ? thanks!
Comment 4 Shay 2016-09-22 02:48:37 UTC
I've disabled incremental build and enabled back Link SDK only.
Result: compilation without error.
Application bundle installed on phone.
Application bundle installed on watch.
Upload succeeded.

However...
The debugger is stuck at "Waiting for the app to connect on port 10000 via WiFi".
The app launches, the progress bar is circling for a few seconds and then the app disappears from view. 
Several seconds later, it seems like it is trying to relaunch, and the whole thing repeats (progress bar, then app disappears). Debugger never connects.
Comment 5 Sebastien Pouliot 2016-09-22 02:51:16 UTC
Thanks for confirming this.

The debugging issue is likely something different and should be filed separately to avoid confusion.
Comment 6 Shay 2016-09-22 02:52:54 UTC
OK. I will post a separate bug.
Comment 7 Sebastien Pouliot 2016-09-22 02:54:09 UTC
*** Bug 44599 has been marked as a duplicate of this bug. ***
Comment 8 Rolf Bjarne Kvinge [MSFT] 2016-09-22 05:09:43 UTC
This is already fixed internally (the fix will be included in C9).

*** This bug has been marked as a duplicate of bug 44048 ***