Bug 43558 - MTOUCH: error MT4109: Failed to compile the generated registrar code.
Summary: MTOUCH: error MT4109: Failed to compile the generated registrar code.
Status: RESOLVED DUPLICATE of bug 43836
Alias: None
Product: iOS
Classification: Xamarin
Component: Tools ()
Version: XI 9.8 (tvOS / C7)
Hardware: PC Mac OS
: --- normal
Target Milestone: Untriaged
Assignee: Rolf Bjarne Kvinge [MSFT]
URL:
Depends on:
Blocks:
 
Reported: 2016-08-20 16:42 UTC by azeesmile
Modified: 2016-10-13 17:36 UTC (History)
6 users (show)

Tags:
Is this bug a regression?: ---
Last known good build:


Attachments
Complete Error log attached. (202.22 KB, text/rtf)
2016-08-20 16:42 UTC, azeesmile
Details
Here is registrar.m file. (240.08 KB, text/plain)
2016-08-21 18:21 UTC, azeesmile
Details


Notice (2018-05-24): bugzilla.xamarin.com is now in read-only mode.

Please join us on Visual Studio Developer Community and in the Xamarin and Mono organizations on GitHub to continue tracking issues. Bugzilla will remain available for reference in read-only mode. We will continue to work on open Bugzilla bugs, copy them to the new locations as needed for follow-up, and add the new items under Related Links.

Our sincere thanks to everyone who has contributed on this bug tracker over the years. Thanks also for your understanding as we make these adjustments and improvements for the future.


Please create a new report on Developer Community or GitHub with your current version information, steps to reproduce, and relevant error messages or log files if you are hitting an issue that looks similar to this resolved bug and you do not yet see a matching new report.

Related Links:
Status:
RESOLVED DUPLICATE of bug 43836

Description azeesmile 2016-08-20 16:42:00 UTC
Created attachment 17137 [details]
Complete Error log attached.

/Applications/Xcode.app/Contents/Developer/Toolchains/XcodeDefault.xctoolchain/usr/bin/clang  -isysroot /Applications/Xcode.app/Contents/Developer/Platforms/iPhoneOS.platform/Developer/SDKs/iPhoneOS9.3.sdk -Qunused-arguments -miphoneos-version-min=9.2 -arch armv7 -c -o /Users/confiz-2333/Downloads/App6/eCase.Mobile.Investigations/obj/iPhone/Debug/mtouch-cache/eCaseMobileInvestigations.exe.armv7.o -x assembler /Users/confiz-2333/Downloads/App6/eCase.Mobile.Investigations/obj/iPhone/Debug/mtouch-cache/eCaseMobileInvestigations.exe.armv7.s -DDEBUG
		MONO_PATH=/Users/confiz-2333/Downloads/App6/eCase.Mobile.Investigations/obj/iPhone/Debug/mtouch-cache/Build /Library/Frameworks/Xamarin.iOS.framework/Versions/9.8.2.22/bin/arm-darwin-mono-sgen --debug -O=gsharedvt  --aot=mtriple=armv7-ios,data-outfile=/Users/confiz-2333/Downloads/App6/eCase.Mobile.Investigations/obj/iPhone/Debug/mtouch-cache/System.Data.armv7.aotdata,static,asmonly,direct-icalls,full,dwarfdebug,no-direct-calls,outfile=/Users/confiz-2333/Downloads/App6/eCase.Mobile.Investigations/obj/iPhone/Debug/mtouch-cache/System.Data.dll.armv7.s "/Users/confiz-2333/Downloads/App6/eCase.Mobile.Investigations/obj/iPhone/Debug/mtouch-cache/Build/System.Data.dll"
		WARNING: The runtime version supported by this application is unavailable.
		Using default runtime: v4.0.30319
		Mono Ahead of Time compiler - compiling assembly /Users/confiz-2333/Downloads/App6/eCase.Mobile.Investigations/obj/iPhone/Debug/mtouch-cache/Build/BTProgressHUD.dll
		Code: 93384(72%) Info: 733(0%) Ex Info: 27386(21%) Unwind Info: 4316(3%) Class Info: 1096(0%) PLT: 173(0%) GOT Info: 1655(1%) Offsets: 810(0%) GOT: 1648
		Compiled: 124/124 (100%), No GOT slots: 0 (0%), Direct calls: 10 (5%)
		Output file: '/Users/confiz-2333/Downloads/App6/eCase.Mobile.Investigations/obj/iPhone/Debug/mtouch-cache/BTProgressHUD.dll.armv7.s'.
		Linking symbol: '_mono_aot_module_BTProgressHUD_info'.
		JIT time: 35 ms, Generation time: 35 ms, Assembly+Link time: 0 ms.
		
		Mono Ahead of Time compiler - compiling assembly /Users/confiz-2333/Downloads/App6/eCase.Mobile.Investigations/obj/iPhone/Debug/mtouch-cache/Build/System.Data.dll
		Code: 1210016(68%) Info: 25256(1%) Ex Info: 385916(21%) Unwind Info: 73401(4%) Class Info: 11298(0%) PLT: 3383(0%) GOT Info: 52273(2%) Offsets: 15208(0%) GOT: 21068
		Compiled: 3714/3714 (100%), No GOT slots: 1821 (49%), Direct calls: 201 (2%)
		Output file: '/Users/confiz-2333/Downloads/App6/eCase.Mobile.Investigations/obj/iPhone/Debug/mtouch-cache/System.Data.dll.armv7.s'.
		Linking symbol: '_mono_aot_module_System_Data_info'.
		JIT time: 584 ms, Generation time: 627 ms, Assembly+Link time: 12 ms.
		
		Mono Ahead of Time compiler - compiling assembly /Users/confiz-2333/Downloads/App6/eCase.Mobile.Investigations/obj/iPhone/Debug/mtouch-cache/Build/System.Core.dll
		Code: 19068(50%) Info: 203(0%) Ex Info: 8672(23%) Unwind Info: 2536(6%) Class Info: 74(0%) PLT: 262(0%) GOT Info: 6496(17%) Offsets: 405(1%) GOT: 1184
		Compiled: 76/76 (100%), No GOT slots: 63 (82%), Direct calls: 11 (32%)
		Output file: '/Users/confiz-2333/Downloads/App6/eCase.Mobile.Investigations/obj/iPhone/Debug/mtouch-cache/System.Core.dll.armv7.s'.
		Linking symbol: '_mono_aot_module_System_Core_info'.
		/Applications/Xcode.app/Contents/Developer/Toolchains/XcodeDefault.xctoolchain/usr/bin/clang  -isysroot /Applications/Xcode.app/Contents/Developer/Platforms/iPhoneOS.platform/Developer/SDKs/iPhoneOS9.3.sdk -Qunused-arguments -miphoneos-version-min=9.2 -arch armv7 -c -o /Users/confiz-2333/Downloads/App6/eCase.Mobile.Investigations/obj/iPhone/Debug/mtouch-cache/BTProgressHUD.dll.armv7.o -x assembler /Users/confiz-2333/Downloads/App6/eCase.Mobile.Investigations/obj/iPhone/Debug/mtouch-cache/BTProgressHUD.dll.armv7.s -DDEBUG
		JIT time: 29 ms, Generation time: 22 ms, Assembly+Link time: 0 ms.
		
		/Applications/Xcode.app/Contents/Developer/Toolchains/XcodeDefault.xctoolchain/usr/bin/clang  -isysroot /Applications/Xcode.app/Contents/Developer/Platforms/iPhoneOS.platform/Developer/SDKs/iPhoneOS9.3.sdk -Qunused-arguments -miphoneos-version-min=9.2 -arch armv7 -c -o /Users/confiz-2333/Downloads/App6/eCase.Mobile.Investigations/obj/iPhone/Debug/mtouch-cache/System.Core.dll.armv7.o -x assembler /Users/confiz-2333/Downloads/App6/eCase.Mobile.Investigations/obj/iPhone/Debug/mtouch-cache/System.Core.dll.armv7.s -DDEBUG
		/Applications/Xcode.app/Contents/Developer/Toolchains/XcodeDefault.xctoolchain/usr/bin/clang  -isysroot /Applications/Xcode.app/Contents/Developer/Platforms/iPhoneOS.platform/Developer/SDKs/iPhoneOS9.3.sdk -Qunused-arguments -miphoneos-version-min=9.2 -arch armv7 -c -o /Users/confiz-2333/Downloads/App6/eCase.Mobile.Investigations/obj/iPhone/Debug/mtouch-cache/System.Data.dll.armv7.o -x assembler /Users/confiz-2333/Downloads/App6/eCase.Mobile.Investigations/obj/iPhone/Debug/mtouch-cache/System.Data.dll.armv7.s -DDEBUG
		Mono Ahead of Time compiler - compiling assembly /Users/confiz-2333/Downloads/App6/eCase.Mobile.Investigations/obj/iPhone/Debug/mtouch-cache/Build/mscorlib.dll
		Code: 2462152(63%) Info: 50074(1%) Ex Info: 914013(23%) Unwind Info: 159690(4%) Class Info: 31139(0%) PLT: 8624(0%) GOT Info: 187560(4%) Offsets: 45588(1%) GOT: 51324
		Compiled: 10511/10511 (100%), No GOT slots: 6976 (66%), Direct calls: 4840 (24%)
		Output file: '/Users/confiz-2333/Downloads/App6/eCase.Mobile.Investigations/obj/iPhone/Debug/mtouch-cache/mscorlib.dll.armv7.s'.
		Linking symbol: '_mono_aot_module_mscorlib_info'.
		JIT time: 1152 ms, Generation time: 2018 ms, Assembly+Link time: 52 ms.
		
		/Applications/Xcode.app/Contents/Developer/Toolchains/XcodeDefault.xctoolchain/usr/bin/clang  -isysroot /Applications/Xcode.app/Contents/Developer/Platforms/iPhoneOS.platform/Developer/SDKs/iPhoneOS9.3.sdk -Qunused-arguments -miphoneos-version-min=9.2 -arch armv7 -c -o /Users/confiz-2333/Downloads/App6/eCase.Mobile.Investigations/obj/iPhone/Debug/mtouch-cache/mscorlib.dll.armv7.o -x assembler /Users/confiz-2333/Downloads/App6/eCase.Mobile.Investigations/obj/iPhone/Debug/mtouch-cache/mscorlib.dll.armv7.s -DDEBUG
		MONO_PATH=/Users/confiz-2333/Downloads/App6/eCase.Mobile.Investigations/obj/iPhone/Debug/mtouch-cache/Build /Library/Frameworks/Xamarin.iOS.framework/Versions/9.8.2.22/bin/arm-darwin-mono-sgen --debug -O=gsharedvt  --aot=mtriple=armv7-ios,data-outfile=/Users/confiz-2333/Downloads/App6/eCase.Mobile.Investigations/obj/iPhone/Debug/mtouch-cache/monotouch.armv7.aotdata,static,asmonly,direct-icalls,full,dwarfdebug,no-direct-calls,outfile=/Users/confiz-2333/Downloads/App6/eCase.Mobile.Investigations/obj/iPhone/Debug/mtouch-cache/monotouch.dll.armv7.s "/Users/confiz-2333/Downloads/App6/eCase.Mobile.Investigations/obj/iPhone/Debug/mtouch-cache/Build/monotouch.dll"
		MONO_PATH=/Users/confiz-2333/Downloads/App6/eCase.Mobile.Investigations/obj/iPhone/Debug/mtouch-cache/Build /Library/Frameworks/Xamarin.iOS.framework/Versions/9.8.2.22/bin/arm-darwin-mono-sgen --debug -O=gsharedvt  --aot=mtriple=armv7-ios,data-outfile=/Users/confiz-2333/Downloads/App6/eCase.Mobile.Investigations/obj/iPhone/Debug/mtouch-cache/System.Web.Services.armv7.aotdata,static,asmonly,direct-icalls,full,dwarfdebug,no-direct-calls,outfile=/Users/confiz-2333/Downloads/App6/eCase.Mobile.Investigations/obj/iPhone/Debug/mtouch-cache/System.Web.Services.dll.armv7.s "/Users/confiz-2333/Downloads/App6/eCase.Mobile.Investigations/obj/iPhone/Debug/mtouch-cache/Build/System.Web.Services.dll"
		Mono Ahead of Time compiler - compiling assembly /Users/confiz-2333/Downloads/App6/eCase.Mobile.Investigations/obj/iPhone/Debug/mtouch-cache/Build/System.Web.Services.dll
		Code: 234840(67%) Info: 5154(1%) Ex Info: 78166(22%) Unwind Info: 12885(3%) Class Info: 6689(1%) PLT: 664(0%) GOT Info: 8825(2%) Offsets: 3838(1%) GOT: 4720
		Compiled: 943/943 (100%), No GOT slots: 496 (52%), Direct calls: 79 (13%)
		Output file: '/Users/confiz-2333/Downloads/App6/eCase.Mobile.Investigations/obj/iPhone/Debug/mtouch-cache/System.Web.Services.dll.armv7.s'.
		Linking symbol: '_mono_aot_module_System_Web_Services_info'.
		JIT time: 213 ms, Generation time: 219 ms, Assembly+Link time: 1 ms.
		
		/Applications/Xcode.app/Contents/Developer/Toolchains/XcodeDefault.xctoolchain/usr/bin/clang  -isysroot /Applications/Xcode.app/Contents/Developer/Platforms/iPhoneOS.platform/Developer/SDKs/iPhoneOS9.3.sdk -Qunused-arguments -miphoneos-version-min=9.2 -arch armv7 -c -o /Users/confiz-2333/Downloads/App6/eCase.Mobile.Investigations/obj/iPhone/Debug/mtouch-cache/System.Web.Services.dll.armv7.o -x assembler /Users/confiz-2333/Downloads/App6/eCase.Mobile.Investigations/obj/iPhone/Debug/mtouch-cache/System.Web.Services.dll.armv7.s -DDEBUG
		Mono Ahead of Time compiler - compiling assembly /Users/confiz-2333/Downloads/App6/eCase.Mobile.Investigations/obj/iPhone/Debug/mtouch-cache/Build/monotouch.dll
		Code: 626684(61%) Info: 19952(1%) Ex Info: 231588(22%) Unwind Info: 44520(4%) Class Info: 38411(3%) PLT: 2331(0%) GOT Info: 35459(3%) Offsets: 18468(1%) GOT: 17380
		Compiled: 3833/3833 (100%), No GOT slots: 1448 (37%), Direct calls: 889 (15%)
		Output file: '/Users/confiz-2333/Downloads/App6/eCase.Mobile.Investigations/obj/iPhone/Debug/mtouch-cache/monotouch.dll.armv7.s'.
		Linking symbol: '_mono_aot_module_monotouch_info'.
		JIT time: 557 ms, Generation time: 822 ms, Assembly+Link time: 7 ms.
		
		/Applications/Xcode.app/Contents/Developer/Toolchains/XcodeDefault.xctoolchain/usr/bin/clang  -isysroot /Applications/Xcode.app/Contents/Developer/Platforms/iPhoneOS.platform/Developer/SDKs/iPhoneOS9.3.sdk -Qunused-arguments -miphoneos-version-min=9.2 -arch armv7 -c -o /Users/confiz-2333/Downloads/App6/eCase.Mobile.Investigations/obj/iPhone/Debug/mtouch-cache/monotouch.dll.armv7.o -x assembler /Users/confiz-2333/Downloads/App6/eCase.Mobile.Investigations/obj/iPhone/Debug/mtouch-cache/monotouch.dll.armv7.s -DDEBUG
		/Applications/Xcode.app/Contents/Developer/Toolchains/XcodeDefault.xctoolchain/usr/bin/clang  -Wno-receiver-forward-class -gdwarf-2 -I/Library/Frameworks/Xamarin.iOS.framework/Versions/9.8.2.22/SDKs/MonoTouch.iphoneos.sdk/usr/include -isysroot /Applications/Xcode.app/Contents/Developer/Platforms/iPhoneOS.platform/Developer/SDKs/iPhoneOS9.3.sdk -Qunused-arguments -miphoneos-version-min=9.2 -arch armv7 -c -o /Users/confiz-2333/Downloads/App6/eCase.Mobile.Investigations/obj/iPhone/Debug/mtouch-cache/registrar.armv7.o -x objective-c++ /Users/confiz-2333/Downloads/App6/eCase.Mobile.Investigations/obj/iPhone/Debug/mtouch-cache/registrar.m -DDEBUG
		MONO_PATH=/Users/confiz-2333/Downloads/App6/eCase.Mobile.Investigations/obj/iPhone/Debug/mtouch-cache/Build /Library/Frameworks/Xamarin.iOS.framework/Versions/9.8.2.22/bin/arm-darwin-mono-sgen --debug -O=gsharedvt  --aot=mtriple=armv7-ios,data-outfile=/Users/confiz-2333/Downloads/App6/eCase.Mobile.Investigations/obj/iPhone/Debug/mtouch-cache/System.armv7.aotdata,static,asmonly,direct-icalls,full,dwarfdebug,no-direct-calls,outfile=/Users/confiz-2333/Downloads/App6/eCase.Mobile.Investigations/obj/iPhone/Debug/mtouch-cache/System.dll.armv7.s "/Users/confiz-2333/Downloads/App6/eCase.Mobile.Investigations/obj/iPhone/Debug/mtouch-cache/Build/System.dll"
		MONO_PATH=/Users/confiz-2333/Downloads/App6/eCase.Mobile.Investigations/obj/iPhone/Debug/mtouch-cache/Build /Library/Frameworks/Xamarin.iOS.framework/Versions/9.8.2.22/bin/arm-darwin-mono-sgen --debug -O=gsharedvt  --aot=mtriple=armv7-ios,data-outfile=/Users/confiz-2333/Downloads/App6/eCase.Mobile.Investigations/obj/iPhone/Debug/mtouch-cache/InfoJetSoft.Mobile.armv7.aotdata,static,asmonly,direct-icalls,full,soft-debug,dwarfdebug,no-direct-calls,outfile=/Users/confiz-2333/Downloads/App6/eCase.Mobile.Investigations/obj/iPhone/Debug/mtouch-cache/InfoJetSoft.Mobile.dll.armv7.s "/Users/confiz-2333/Downloads/App6/eCase.Mobile.Investigations/obj/iPhone/Debug/mtouch-cache/Build/InfoJetSoft.Mobile.dll"
		Mono Ahead of Time compiler - compiling assembly /Users/confiz-2333/Downloads/App6/eCase.Mobile.Investigations/obj/iPhone/Debug/mtouch-cache/Build/System.dll
		Code: 1030300(64%) Info: 24485(1%) Ex Info: 362990(22%) Unwind Info: 74346(4%) Class Info: 19510(1%) PLT: 3765(0%) GOT Info: 73481(4%) Offsets: 18660(1%) GOT: 26124
		Compiled: 4000/4000 (100%), No GOT slots: 2439 (60%), Direct calls: 1060 (24%)
		Output file: '/Users/confiz-2333/Downloads/App6/eCase.Mobile.Investigations/obj/iPhone/Debug/mtouch-cache/System.dll.armv7.s'.
		Linking symbol: '_mono_aot_module_System_info'.
		JIT time: 751 ms, Generation time: 1634 ms, Assembly+Link time: 160 ms.
		
		/Applications/Xcode.app/Contents/Developer/Toolchains/XcodeDefault.xctoolchain/usr/bin/clang  -isysroot /Applications/Xcode.app/Contents/Developer/Platforms/iPhoneOS.platform/Developer/SDKs/iPhoneOS9.3.sdk -Qunused-arguments -miphoneos-version-min=9.2 -arch armv7 -c -o /Users/confiz-2333/Downloads/App6/eCase.Mobile.Investigations/obj/iPhone/Debug/mtouch-cache/System.dll.armv7.o -x assembler /Users/confiz-2333/Downloads/App6/eCase.Mobile.Investigations/obj/iPhone/Debug/mtouch-cache/System.dll.armv7.s -DDEBUG
		Process exited with code 1, command:
		/Applications/Xcode.app/Contents/Developer/Toolchains/XcodeDefault.xctoolchain/usr/bin/clang  -Wno-receiver-forward-class -gdwarf-2 -I/Library/Frameworks/Xamarin.iOS.framework/Versions/9.8.2.22/SDKs/MonoTouch.iphoneos.sdk/usr/include -isysroot /Applications/Xcode.app/Contents/Developer/Platforms/iPhoneOS.platform/Developer/SDKs/iPhoneOS9.3.sdk -Qunused-arguments -miphoneos-version-min=9.2 -arch armv7 -c -o /Users/confiz-2333/Downloads/App6/eCase.Mobile.Investigations/obj/iPhone/Debug/mtouch-cache/registrar.armv7.o -x objective-c++ /Users/confiz-2333/Downloads/App6/eCase.Mobile.Investigations/obj/iPhone/Debug/mtouch-cache/registrar.m -DDEBUG
		/Users/confiz-2333/Downloads/App6/eCase.Mobile.Investigations/obj/iPhone/Debug/mtouch-cache/registrar.m:2370:141: error: unknown type name 'MonoTouch_Foundation_NSUrlProtocolClient'
		static id native_to_managed_trampoline_64 (id self, SEL _cmd, MonoMethod **managed_method_ptr, NSURLRequest * p0, NSCachedURLResponse * p1, MonoTouch_Foundation_NSUrlProtocolClient * p2, const char *r0, const char *r1, const char *r2, const char *r3, const char *r4, bool* call_super)
		                                                                                                                                            ^ 
		/Users/confiz-2333/Downloads/App6/eCase.Mobile.Investigations/obj/iPhone/Debug/mtouch-cache/registrar.m:6114:11: error: no matching function for call to 'native_to_managed_trampoline_64'
		                id rv = native_to_managed_trampoline_64 (self, _cmd, &managed_method, p0, p1, p2, "MonoTouch.Foundation.NSUrlRequest, monotouch", "MonoTouch.Foundation.NSCachedUrlResponse, monotouch", "MonoTouch.Foundation.NSUrlProtocolClient, monotouch", "InfoJetSoft.Mobile.InfoJetMobileEditor, InfoJetSoft.Mobile", ".ctor", &call_super);
		                        ^~~~~~~~~~~~~~~~~~~~~~~~~~~~~~~
		/Users/confiz-2333/Downloads/App6/eCase.Mobile.Investigations/obj/iPhone/Debug/mtouch-cache/registrar.m:2370:11: note: candidate function not viable: no known conversion from 'MonoTouch_Foundation_NSUrlProtocolClient *' to 'int *' for 6th argument
		static id native_to_managed_trampoline_64 (id self, SEL _cmd, MonoMethod **managed_method_ptr, NSURLRequest * p0, NSCachedURLResponse * p1, MonoTouch_Foundation_NSUrlProtocolClient * p2, const char *r0, const char *r1, const char *r2, const char *r3, const char *r4, bool* call_super)
		          ^ 
		2 errors generated.
		
		WARNING: The runtime version supported by this application is unavailable.
		Using default runtime: v4.0.30319
		Mono Ahead of Time compiler - compiling assembly /Users/confiz-2333/Downloads/App6/eCase.Mobile.Investigations/obj/iPhone/Debug/mtouch-cache/Build/InfoJetSoft.Mobile.dll
		Code: 8252980(72%) Info: 109586(0%) Ex Info: 2618871(22%) Unwind Info: 198254(1%) Class Info: 57822(0%) PLT: 8434(0%) GOT Info: 109513(0%) Offsets: 72503(0%) GOT: 107528
		Compiled: 12015/12015 (100%), No GOT slots: 0 (0%), Direct calls: 884 (3%)
		Output file: '/Users/confiz-2333/Downloads/App6/eCase.Mobile.Investigations/obj/iPhone/Debug/mtouch-cache/InfoJetSoft.Mobile.dll.armv7.s'.
		Linking symbol: '_mono_aot_module_InfoJetSoft_Mobile_info'.
		JIT time: 2424 ms, Generation time: 1990 ms, Assembly+Link time: 44 ms.
		
		/Applications/Xcode.app/Contents/Developer/Toolchains/XcodeDefault.xctoolchain/usr/bin/clang  -isysroot /Applications/Xcode.app/Contents/Developer/Platforms/iPhoneOS.platform/Developer/SDKs/iPhoneOS9.3.sdk -Qunused-arguments -miphoneos-version-min=9.2 -arch armv7 -c -o /Users/confiz-2333/Downloads/App6/eCase.Mobile.Investigations/obj/iPhone/Debug/mtouch-cache/InfoJetSoft.Mobile.dll.armv7.o -x assembler /Users/confiz-2333/Downloads/App6/eCase.Mobile.Investigations/obj/iPhone/Debug/mtouch-cache/InfoJetSoft.Mobile.dll.armv7.s -DDEBUG
MTOUCH: error MT4109: Failed to compile the generated registrar code. Please file a bug report at http://bugzilla.xamarin.com
	Task "MTouch" execution -- FAILED
	Done building target "_CompileToNative" in project "/Users/confiz-2333/Downloads/App6/eCase.Mobile.Investigations/eCase.Mobile.Investigations.csproj".-- FAILED
	
Done building project "/Users/confiz-2333/Downloads/App6/eCase.Mobile.Investigations/eCase.Mobile.Investigations.csproj".-- FAILED

Build FAILED.

Warnings:
Comment 1 Brendan Zagaeski (Xamarin Team, assistant) 2016-08-20 19:30:57 UTC
I am updating the Version field to match the information in Comment 0:

> /Library/Frameworks/Xamarin.iOS.framework/Versions/9.8.2.22
Comment 2 Sebastien Pouliot 2016-08-21 17:32:21 UTC
This looks like a mismatch between the NSUrlProtocolClient protocol and the managed member used to implement it.

This also looks like a classic app (MonoTouch_Foundation_NSUrlProtocolClient) and that type behaved differently from unified (where some breaking changes fixes where applied).


Please attach the following file.

> /Users/confiz-2333/Downloads/App6/eCase.Mobile.Investigations/obj/iPhone/Debug/mtouch-cache/registrar.m 

This will give us a better idea why the code could not be compiled.
Comment 4 azeesmile 2016-08-21 18:21:51 UTC
Created attachment 17150 [details]
Here is registrar.m file.
Comment 6 Rolf Bjarne Kvinge [MSFT] 2016-08-22 09:49:21 UTC
This is most likely a duplicate of bug #42454.

@azeesmile: can you try the latest build from the beta channel (bug #42454 is fixed there) and see if that fixes the issue for you?
Comment 7 azeesmile 2016-08-22 10:02:03 UTC
I am having this screen after navigation. "You are not authorized to access bug #42454."
Comment 8 Rolf Bjarne Kvinge [MSFT] 2016-08-22 10:03:30 UTC
Yes, bug #42454 is not public. Please try the beta channel anyway.
Comment 9 azeesmile 2016-08-22 10:16:23 UTC
I am prohibited to use beta channel right now.
Comment 10 Rolf Bjarne Kvinge [MSFT] 2016-08-22 10:18:02 UTC
I can confirm if it's fixed or not if you can provide a project we can use to reproduce the build error.
Comment 12 Brendan Zagaeski (Xamarin Team, assistant) 2016-08-29 20:09:26 UTC
*** Bug 43836 has been marked as a duplicate of this bug. ***
Comment 13 Rolf Bjarne Kvinge [MSFT] 2016-09-15 11:56:11 UTC
@azeesmile: The fix for bug #43836 is now in the Stable channel, can you try that and see if it fixes the issue for you?
Comment 14 Rolf Bjarne Kvinge [MSFT] 2016-10-13 17:36:56 UTC
Closing as duplicate of #43836.

*** This bug has been marked as a duplicate of bug 43836 ***