Bug 43323 - c9633e3 CI build fails to build application
Summary: c9633e3 CI build fails to build application
Status: VERIFIED FIXED
Alias: None
Product: iOS
Classification: Xamarin
Component: Pre-release ()
Version: XI 9.99 (iOS 10 previews)
Hardware: Macintosh Mac OS
: --- normal
Target Milestone: Xcode8 (iOS10)
Assignee: Bugzilla
URL:
Depends on:
Blocks:
 
Reported: 2016-08-12 20:33 UTC by kkurz
Modified: 2016-08-22 05:01 UTC (History)
7 users (show)

Tags:
Is this bug a regression?: ---
Last known good build:


Attachments
Repro case (13.12 KB, application/zip)
2016-08-13 00:07 UTC, kkurz
Details


Notice (2018-05-24): bugzilla.xamarin.com is now in read-only mode.

Please join us on Visual Studio Developer Community and in the Xamarin and Mono organizations on GitHub to continue tracking issues. Bugzilla will remain available for reference in read-only mode. We will continue to work on open Bugzilla bugs, copy them to the new locations as needed for follow-up, and add the new items under Related Links.

Our sincere thanks to everyone who has contributed on this bug tracker over the years. Thanks also for your understanding as we make these adjustments and improvements for the future.


Please create a new report on Developer Community or GitHub with your current version information, steps to reproduce, and relevant error messages or log files if you are hitting an issue that looks similar to this resolved bug and you do not yet see a matching new report.

Related Links:
Status:
VERIFIED FIXED

Description kkurz 2016-08-12 20:33:55 UTC
I'm running CI builds of xamarin.ios and the c9633e3 build fails with the error "no device operating system information found". Going back to 65ffc88 works, not sure about the two builds in between. Just thought you guys would want to know.
Comment 1 Alex Soto [MSFT] 2016-08-12 22:52:29 UTC
Hello please include your full build logs and if possible a small test case. Also please tell us how are you getting this error? (i.e Debug|Release, Simulator|Device) if device which device?


@jeff is it possible that this commit could be causing this?

https://github.com/xamarin/xamarin-macios/commit/ec56c6103d529d2f3384d2cf5c184d81ec5ff306
Comment 2 kkurz 2016-08-13 00:05:49 UTC
Build output (Xamarin information below)

Building Solution: Softphone (Debug|iPhone)

Build started 8/12/2016 4:56:05 PM.
__________________________________________________
Project "/Users/kkurz/Git/softphones/Client.pcl.fsharp/Client.pcl.fsharp.fsproj" (Build target(s)):
	
	Target PrepareForBuild:
		Configuration: Debug Platform: AnyCPU
	
	Target GenerateSatelliteAssemblies:
	No input files were specified for target GenerateSatelliteAssemblies, skipping.
	
	Target CoreCompile:
	Skipping target "CoreCompile" because its outputs are up-to-date.
Done building project "/Users/kkurz/Git/softphones/Client.pcl.fsharp/Client.pcl.fsharp.fsproj".

Build succeeded.
	 0 Warning(s)
	 0 Error(s)

Time Elapsed 00:00:00.1383680

Build started 8/12/2016 4:56:05 PM.
__________________________________________________
Project "/Users/kkurz/Git/softphones/UITests.ios.csharp/UITests.ios.csharp.csproj" (Build target(s)):
	
	Target PrepareForBuild:
		Configuration: Debug Platform: AnyCPU
	
	Target GenerateSatelliteAssemblies:
	No input files were specified for target GenerateSatelliteAssemblies, skipping.
	
	Target GenerateTargetFrameworkMonikerAttribute:
	Skipping target "GenerateTargetFrameworkMonikerAttribute" because its outputs are up-to-date.
	
	Target CoreCompile:
	Skipping target "CoreCompile" because its outputs are up-to-date.
Done building project "/Users/kkurz/Git/softphones/UITests.ios.csharp/UITests.ios.csharp.csproj".

Build succeeded.
	 0 Warning(s)
	 0 Error(s)

Time Elapsed 00:00:00.0667230

Build started 8/12/2016 4:56:05 PM.
__________________________________________________
Project "/Users/kkurz/Git/softphones/Platform.ios.csharp/Platform.ios.csharp.csproj" (Build target(s)):
	
	Target PrepareForBuild:
		Configuration: Debug Platform: AnyCPU
	
	Target _DetectAppManifest:
		FindItemWithLogicalName Task
		  Items: <null>
		  LogicalName: Info.plist
		  ProjectDir: /Users/kkurz/Git/softphones/Platform.ios.csharp
		  ResourcePrefix: Resources
	
	Target _DetectSdkLocations:
		DetectSdkLocations Task
		  TargetFrameworkIdentifier: Xamarin.iOS
		  TargetArchitectures: <null>
		  SdkVersion: 10.0
		  XamarinSdkRoot: /Library/Frameworks/Xamarin.iOS.framework/Versions/Current
		  SdkRoot: /Applications/Xcode-beta.app/Contents/Developer/Platforms/iPhoneOS.platform/Developer/SDKs/iPhoneOS10.0.sdk
		  SdkDevPath: /Applications/Xcode-beta.app/Contents/Developer
		  SdkUsrPath: /Applications/Xcode-beta.app/Contents/Developer/Platforms/iPhoneOS.platform/Developer/usr
		  SdkPlatform: iPhoneOS
		  SdkIsSimulator: False
	
	Target _BeforeCoreCompileInterfaceDefinitions:
	No input files were specified for target _BeforeCoreCompileInterfaceDefinitions, skipping.
	
	Target _CoreCompileInterfaceDefinitions:
	No input files were specified for target _CoreCompileInterfaceDefinitions, skipping.
	
	Target _BeforeCoreCompileImageAssets:
	No input files were specified for target _BeforeCoreCompileImageAssets, skipping.
	
	Target _CoreCompileImageAssets:
	No input files were specified for target _CoreCompileImageAssets, skipping.
	
	Target _BeforeCoreCompileSceneKitAssets:
	No input files were specified for target _BeforeCoreCompileSceneKitAssets, skipping.
	
	Target _CoreCompileSceneKitAssets:
	No input files were specified for target _CoreCompileSceneKitAssets, skipping.
	
	Target _BeforeCompileTextureAtlases:
	No input files were specified for target _BeforeCompileTextureAtlases, skipping.
	
	Target _CoreCompileTextureAtlases:
	No input files were specified for target _CoreCompileTextureAtlases, skipping.
	
	Target _CollectBundleResources:
		CollectBundleResources Task
		  BundleResources:
		  OptimizePropertyLists: True
		  OptimizePNGs: True
		  ProjectDir: /Users/kkurz/Git/softphones/Platform.ios.csharp
		  ResourcePrefix: Resources
	
	Target _CoreOptimizePngImages:
	No output files were specified for target _CoreOptimizePngImages, skipping.
	
	Target _CoreOptimizePropertyLists:
	No input files were specified for target _CoreOptimizePropertyLists, skipping.
	
	Target _CoreOptimizeLocalizationFiles:
	No input files were specified for target _CoreOptimizeLocalizationFiles, skipping.
	
	Target _PackLibraryResources:
		PackLibraryResources Task
		  BundleResourcesWithLogicalNames: <null>
		  Prefix: monotouch
	
	Target GenerateSatelliteAssemblies:
	No input files were specified for target GenerateSatelliteAssemblies, skipping.
	
	Target GenerateTargetFrameworkMonikerAttribute:
	Skipping target "GenerateTargetFrameworkMonikerAttribute" because its outputs are up-to-date.
	
	Target CoreCompile:
	Skipping target "CoreCompile" because its outputs are up-to-date.
Done building project "/Users/kkurz/Git/softphones/Platform.ios.csharp/Platform.ios.csharp.csproj".

Build succeeded.
	 0 Warning(s)
	 0 Error(s)

Time Elapsed 00:00:00.2076080

Build started 8/12/2016 4:56:06 PM.
__________________________________________________
Project "/Users/kkurz/Git/softphones/UITests.android.csharp/UITests.android.csharp.csproj" (Build target(s)):
	
	Target PrepareForBuild:
		Configuration: Debug Platform: AnyCPU
	
	Target GenerateSatelliteAssemblies:
	No input files were specified for target GenerateSatelliteAssemblies, skipping.
	
	Target GenerateTargetFrameworkMonikerAttribute:
	Skipping target "GenerateTargetFrameworkMonikerAttribute" because its outputs are up-to-date.
	
	Target CoreCompile:
	Skipping target "CoreCompile" because its outputs are up-to-date.
Done building project "/Users/kkurz/Git/softphones/UITests.android.csharp/UITests.android.csharp.csproj".

Build succeeded.
	 0 Warning(s)
	 0 Error(s)

Time Elapsed 00:00:00.2910130

Build started 8/12/2016 4:56:06 PM.
__________________________________________________
Project "/Users/kkurz/Git/softphones/Client.ios.fsharp/Client.ios.fsharp.fsproj" (Build target(s)):
	
	Target PrepareForBuild:
		Configuration: Debug Platform: AnyCPU
	
	Target _DetectAppManifest:
		FindItemWithLogicalName Task
		  Items:
		    Resources/AboutResources.txt
		  LogicalName: Info.plist
		  ProjectDir: /Users/kkurz/Git/softphones/Client.ios.fsharp
		  ResourcePrefix: Resources
	
	Target _DetectSdkLocations:
		DetectSdkLocations Task
		  TargetFrameworkIdentifier: Xamarin.iOS
		  TargetArchitectures: <null>
		  SdkVersion: 10.0
		  XamarinSdkRoot: /Library/Frameworks/Xamarin.iOS.framework/Versions/Current
		  SdkRoot: /Applications/Xcode-beta.app/Contents/Developer/Platforms/iPhoneOS.platform/Developer/SDKs/iPhoneOS10.0.sdk
		  SdkDevPath: /Applications/Xcode-beta.app/Contents/Developer
		  SdkUsrPath: /Applications/Xcode-beta.app/Contents/Developer/Platforms/iPhoneOS.platform/Developer/usr
		  SdkPlatform: iPhoneOS
		  SdkIsSimulator: False
	
	Target _BeforeCoreCompileInterfaceDefinitions:
	No input files were specified for target _BeforeCoreCompileInterfaceDefinitions, skipping.
	
	Target _CoreCompileInterfaceDefinitions:
	No input files were specified for target _CoreCompileInterfaceDefinitions, skipping.
	
	Target _BeforeCoreCompileImageAssets:
	No input files were specified for target _BeforeCoreCompileImageAssets, skipping.
	
	Target _CoreCompileImageAssets:
	No input files were specified for target _CoreCompileImageAssets, skipping.
	
	Target _BeforeCoreCompileSceneKitAssets:
	No input files were specified for target _BeforeCoreCompileSceneKitAssets, skipping.
	
	Target _CoreCompileSceneKitAssets:
	No input files were specified for target _CoreCompileSceneKitAssets, skipping.
	
	Target _BeforeCompileTextureAtlases:
	No input files were specified for target _BeforeCompileTextureAtlases, skipping.
	
	Target _CoreCompileTextureAtlases:
	No input files were specified for target _CoreCompileTextureAtlases, skipping.
	
	Target _CollectBundleResources:
		CollectBundleResources Task
		  BundleResources:
		  OptimizePropertyLists: True
		  OptimizePNGs: True
		  ProjectDir: /Users/kkurz/Git/softphones/Client.ios.fsharp
		  ResourcePrefix: Resources
	
	Target _CoreOptimizePngImages:
	No output files were specified for target _CoreOptimizePngImages, skipping.
	
	Target _CoreOptimizePropertyLists:
	No input files were specified for target _CoreOptimizePropertyLists, skipping.
	
	Target _CoreOptimizeLocalizationFiles:
	No input files were specified for target _CoreOptimizeLocalizationFiles, skipping.
	
	Target _PackLibraryResources:
		PackLibraryResources Task
		  BundleResourcesWithLogicalNames: <null>
		  Prefix: monotouch
	
	Target GenerateSatelliteAssemblies:
	No input files were specified for target GenerateSatelliteAssemblies, skipping.
	
	Target CoreCompile:
	Skipping target "CoreCompile" because its outputs are up-to-date.
Done building project "/Users/kkurz/Git/softphones/Client.ios.fsharp/Client.ios.fsharp.fsproj".

Build succeeded.
	 0 Warning(s)
	 0 Error(s)

Time Elapsed 00:00:00.5033920

Build started 8/12/2016 4:56:06 PM.
__________________________________________________
Project "/Users/kkurz/Git/softphones/Client.host.fsharp/Client.host.fsharp.fsproj" (Build target(s)):
	
	Target PrepareForBuild:
		Configuration: Debug Platform: AnyCPU
	
	Target GetFrameworkPaths:
/Library/Frameworks/Mono.framework/Versions/4.4.0/lib/mono/4.5/Microsoft.Common.targets:  warning : TargetFrameworkVersion 'v4.5.1' not supported by this toolset (ToolsVersion: 4.0).
	
	Target GenerateSatelliteAssemblies:
	No input files were specified for target GenerateSatelliteAssemblies, skipping.
	
	Target CoreCompile:
	Skipping target "CoreCompile" because its outputs are up-to-date.
Done building project "/Users/kkurz/Git/softphones/Client.host.fsharp/Client.host.fsharp.fsproj".

Build succeeded.

Warnings:

/Users/kkurz/Git/softphones/Client.host.fsharp/Client.host.fsharp.fsproj (Build) ->
/Library/Frameworks/Mono.framework/Versions/4.4.0/lib/mono/4.5/Microsoft.Common.targets (GetFrameworkPaths target) ->

	/Library/Frameworks/Mono.framework/Versions/4.4.0/lib/mono/4.5/Microsoft.Common.targets:  warning : TargetFrameworkVersion 'v4.5.1' not supported by this toolset (ToolsVersion: 4.0).

	 1 Warning(s)
	 0 Error(s)

Time Elapsed 00:00:00.3742390

Build started 8/12/2016 4:56:07 PM.
__________________________________________________
Project "/Users/kkurz/Git/softphones/Platform.ios.fsharp/Platform.ios.fsharp.fsproj" (Build target(s)):
	
	Target PrepareForBuild:
		Configuration: Debug Platform: AnyCPU
	
	Target _DetectAppManifest:
		FindItemWithLogicalName Task
		  Items: <null>
		  LogicalName: Info.plist
		  ProjectDir: /Users/kkurz/Git/softphones/Platform.ios.fsharp
		  ResourcePrefix: Resources
	
	Target _DetectSdkLocations:
		DetectSdkLocations Task
		  TargetFrameworkIdentifier: Xamarin.iOS
		  TargetArchitectures: <null>
		  SdkVersion: 10.0
		  XamarinSdkRoot: /Library/Frameworks/Xamarin.iOS.framework/Versions/Current
		  SdkRoot: /Applications/Xcode-beta.app/Contents/Developer/Platforms/iPhoneOS.platform/Developer/SDKs/iPhoneOS10.0.sdk
		  SdkDevPath: /Applications/Xcode-beta.app/Contents/Developer
		  SdkUsrPath: /Applications/Xcode-beta.app/Contents/Developer/Platforms/iPhoneOS.platform/Developer/usr
		  SdkPlatform: iPhoneOS
		  SdkIsSimulator: False
	
	Target _BeforeCoreCompileInterfaceDefinitions:
	No input files were specified for target _BeforeCoreCompileInterfaceDefinitions, skipping.
	
	Target _CoreCompileInterfaceDefinitions:
	No input files were specified for target _CoreCompileInterfaceDefinitions, skipping.
	
	Target _BeforeCoreCompileImageAssets:
	No input files were specified for target _BeforeCoreCompileImageAssets, skipping.
	
	Target _CoreCompileImageAssets:
	No input files were specified for target _CoreCompileImageAssets, skipping.
	
	Target _BeforeCoreCompileSceneKitAssets:
	No input files were specified for target _BeforeCoreCompileSceneKitAssets, skipping.
	
	Target _CoreCompileSceneKitAssets:
	No input files were specified for target _CoreCompileSceneKitAssets, skipping.
	
	Target _BeforeCompileTextureAtlases:
	No input files were specified for target _BeforeCompileTextureAtlases, skipping.
	
	Target _CoreCompileTextureAtlases:
	No input files were specified for target _CoreCompileTextureAtlases, skipping.
	
	Target _CollectBundleResources:
		CollectBundleResources Task
		  BundleResources:
		  OptimizePropertyLists: True
		  OptimizePNGs: True
		  ProjectDir: /Users/kkurz/Git/softphones/Platform.ios.fsharp
		  ResourcePrefix: Resources
	
	Target _CoreOptimizePngImages:
	No output files were specified for target _CoreOptimizePngImages, skipping.
	
	Target _CoreOptimizePropertyLists:
	No input files were specified for target _CoreOptimizePropertyLists, skipping.
	
	Target _CoreOptimizeLocalizationFiles:
	No input files were specified for target _CoreOptimizeLocalizationFiles, skipping.
	
	Target _PackLibraryResources:
		PackLibraryResources Task
		  BundleResourcesWithLogicalNames: <null>
		  Prefix: monotouch
	
	Target CopyFilesMarkedCopyLocal:
		Copying file from '/Users/kkurz/Git/softphones/packages/PhoneCoreSwig.iOS/lib/Xamarin.iOS10/Debug/PhoneCoreSwig.iOS.dll' to '/Users/kkurz/Git/softphones/Platform.ios.fsharp/bin/Debug/PhoneCoreSwig.iOS.dll'
		Copying file from '/Users/kkurz/Git/softphones/packages/PhoneCoreSwig.iOS/lib/Xamarin.iOS10/Release/PhoneCoreSwig.iOS.dll' to '/Users/kkurz/Git/softphones/Platform.ios.fsharp/bin/Debug/PhoneCoreSwig.iOS.dll'
	
	Target GenerateSatelliteAssemblies:
	No input files were specified for target GenerateSatelliteAssemblies, skipping.
	
	Target CoreCompile:
	Skipping target "CoreCompile" because its outputs are up-to-date.
Done building project "/Users/kkurz/Git/softphones/Platform.ios.fsharp/Platform.ios.fsharp.fsproj".

Build succeeded.
	 0 Warning(s)
	 0 Error(s)

Time Elapsed 00:00:00.5763660

Build started 8/12/2016 4:56:07 PM.
__________________________________________________
Project "/Users/kkurz/Git/softphones/Test.host/Test.host.fsproj" (Build target(s)):
	
	Target PrepareForBuild:
		Configuration: Debug Platform: AnyCPU
	
	Target GetFrameworkPaths:
/Library/Frameworks/Mono.framework/Versions/4.4.0/lib/mono/4.5/Microsoft.Common.targets:  warning : TargetFrameworkVersion 'v4.6.1' not supported by this toolset (ToolsVersion: 4.0).
	
	Target GenerateSatelliteAssemblies:
	No input files were specified for target GenerateSatelliteAssemblies, skipping.
	
	Target CoreCompile:
	Skipping target "CoreCompile" because its outputs are up-to-date.
Done building project "/Users/kkurz/Git/softphones/Test.host/Test.host.fsproj".

Build succeeded.

Warnings:

/Users/kkurz/Git/softphones/Test.host/Test.host.fsproj (Build) ->
/Library/Frameworks/Mono.framework/Versions/4.4.0/lib/mono/4.5/Microsoft.Common.targets (GetFrameworkPaths target) ->

	/Library/Frameworks/Mono.framework/Versions/4.4.0/lib/mono/4.5/Microsoft.Common.targets:  warning : TargetFrameworkVersion 'v4.6.1' not supported by this toolset (ToolsVersion: 4.0).

	 1 Warning(s)
	 0 Error(s)

Time Elapsed 00:00:00.3386180

Build started 8/12/2016 4:56:07 PM.
__________________________________________________
Project "/Users/kkurz/Git/softphones/Softphone.ios/Softphone.ios.csproj" (Build target(s)):
	
	Target PrepareForBuild:
		Configuration: Debug Platform: iPhone
	
	Target _DetectAppManifest:
		FindItemWithLogicalName Task
		  Items:
		    Info.plist
		  LogicalName: Info.plist
		  ProjectDir: /Users/kkurz/Git/softphones/Softphone.ios
		  ResourcePrefix: Resources
	
	Target _ComputeTargetArchitectures:
		ParseDeviceSpecificBuildInformation Task
		  Architectures: ARMv7, ARM64
		  IntermediateOutputPath: obj/iPhone/Debug/
		  OutputPath: bin/iPhone/Debug/
		  TargetFrameworkIdentifier: Xamarin.iOS
		  TargetiOSDevice: <?xml version="1.0" encoding="UTF-8"?>
<!DOCTYPE plist PUBLIC "-//Apple//DTD PLIST 1.0//EN" "http://www.apple.com/DTDs/PropertyList-1.0.dtd">
<plist version="1.0">
<dict>
	<key>device</key>
	<dict>
		<key>architecture</key>
		<string>ARMv6, ARMv7, ARMv7s, ARM64</string>
		<key>model</key>
		<string>iPhone8,1</string>
		<key>os-version</key>
		<string>10.0</string>
	</dict>
</dict>
</plist>

/Library/Frameworks/Mono.framework/External/xbuild/Xamarin/iOS/Xamarin.iOS.Common.targets: error : No device operating system information found.
	Task "ParseDeviceSpecificBuildInformation" execution -- FAILED
	Done building target "_ComputeTargetArchitectures" in project "/Users/kkurz/Git/softphones/Softphone.ios/Softphone.ios.csproj".-- FAILED
	
Done building project "/Users/kkurz/Git/softphones/Softphone.ios/Softphone.ios.csproj".-- FAILED

Build FAILED.
Errors:

/Users/kkurz/Git/softphones/Softphone.ios/Softphone.ios.csproj (Build) ->
/Library/Frameworks/Mono.framework/External/xbuild/Xamarin/iOS/Xamarin.iOS.Common.targets (_ComputeTargetArchitectures target) ->

	/Library/Frameworks/Mono.framework/External/xbuild/Xamarin/iOS/Xamarin.iOS.Common.targets: error : No device operating system information found.

	 0 Warning(s)
	 1 Error(s)

Time Elapsed 00:00:00.1296690

---------------------- Done ----------------------

Build: 1 error, 2 warnings


=== Xamarin Studio Professional ===

Version 6.1 (build 5235)
Installation UUID: 582dde06-8a89-43f2-9b6c-510e4fbebc32
Runtime:
	Mono 4.4.0 (mono-4.4.0-branch/fcf7a6d) (64-bit)
	GTK+ 2.24.23 (Raleigh theme)

	Package version: 404000148

=== NuGet ===

Version: 3.4.3.0

=== Xamarin.Profiler ===

Not Installed

=== Xamarin.Android ===

Not Installed

=== Xamarin Android Player ===

Not Installed

=== Apple Developer Tools ===

Xcode 8.0 (11228.2)
Build 8S193k

=== Xamarin.Mac ===

Not Installed

=== Xamarin.iOS ===

Version: 9.99.2.42 (Visual Studio Professional)
Hash: c9633e3
Branch: cycle8
Build date: 2016-08-12 09:20:29-0400

=== Build Information ===

Release ID: 601005235
Git revision: ec12ea3dd5b59de84d5007bff97f969439ab61cb
Build date: 2016-07-14 10:04:37-04
Xamarin addins: 2fd80118a267f656798bd002da0841811d1acb70
Build lane: monodevelop-lion-cycle8

=== Operating System ===

Mac OS X 10.12.0
Darwin Kyles-MBP 16.0.0 Darwin Kernel Version 16.0.0
    Fri Aug  5 19:25:12 PDT 2016
    root:xnu-3789.1.24~6/RELEASE_X86_64 x86_64
Comment 3 kkurz 2016-08-13 00:07:38 UTC
Created attachment 17016 [details]
Repro case
Comment 4 Sebastien Pouliot 2016-08-16 13:10:47 UTC
A newer XS is needed to match the msbuild changes done in that version XI. Until the next release is out (on the alpha channel) you can try this build

https://bosstoragemirror.blob.core.windows.net/wrench/monodevelop-lion-cycle8/9d/9dbb95ed5ae4be90e38480cfd6323bc605a93a49/XamarinStudio-6.1.0.5341.dmg
Comment 5 Naqeeb 2016-08-16 15:42:12 UTC
I have checked this issue with build given in comment 4 and observed that it is working fine. I am able build successfully sample project given in comment 3. Here is the screencast for the same: http://www.screencast.com/t/zufELMRPKhs

Hence closing this issue.

Environment info: https://gist.github.com/tajinder360/c9bd22feb2c6c610e0f6397949bebe5f
Comment 6 kkurz 2016-08-16 23:41:58 UTC
Reopening, as the msbuild changes in that version of XS break loading the application onto the device. I updated to latest CI build and the attached XS dmg and got this error:

error HE0004: Could not load the framework 'libswiftos.dylib' (path: /Applications/Xcode-beta.app/Contents/Frameworks/libswiftos.dylib): dlopen(/Applications/Xcode-beta.app/Contents/Frameworks/libswiftos.dylib, 1): Library not loaded: @rpath/libswiftXPC.dylib
  Referenced from: /Applications/Xcode-beta.app/Contents/Frameworks/libswiftos.dylib
  Reason: image not found

=== Xamarin Studio Professional ===

Version 6.1 (build 5341)
Installation UUID: 582dde06-8a89-43f2-9b6c-510e4fbebc32
Runtime:
	Mono 4.4.0 (mono-4.4.0-branch/fcf7a6d) (64-bit)
	GTK+ 2.24.23 (Raleigh theme)

	Package version: 404000148

=== NuGet ===

Version: 3.4.3.0

=== Xamarin.Profiler ===

Not Installed

=== Apple Developer Tools ===

Xcode 8.0 (11239.2)
Build 8S201h

=== Xamarin.iOS ===

Version: 9.99.3.8 (Visual Studio Professional)
Hash: 9eca876
Branch: cycle8
Build date: 2016-08-16 18:22:42-0400

=== Xamarin.Android ===

Not Installed

=== Xamarin Android Player ===

Not Installed

=== Xamarin.Mac ===

Not Installed

=== Build Information ===

Release ID: 601005341
Git revision: 9dbb95ed5ae4be90e38480cfd6323bc605a93a49
Build date: 2016-08-15 15:40:45-04
Xamarin addins: b99a75819e90a463a83cc904cb27f922955b30b1
Build lane: monodevelop-lion-cycle8

=== Operating System ===

Mac OS X 10.12.0
Darwin Kyles-MacBook-Pro.local 16.0.0 Darwin Kernel Version 16.0.0
    Fri Aug 12 19:00:53 PDT 2016
    root:xnu-3789.1.28~1/RELEASE_X86_64 x86_64
Comment 7 kkurz 2016-08-16 23:52:43 UTC
EDIT: I think it's actually mlaunch, not msbuild that's failing. See my comments on 42969 for details.
Comment 8 Sebastien Pouliot 2016-08-16 23:59:23 UTC
Yes, that's a different issue.

Beta 6 changes are tracked in #43373.
Comment 9 Shruti 2016-08-22 05:01:03 UTC
As per bug verification status https://bugzilla.xamarin.com/show_bug.cgi?id=42969#c19, we are able to build and deploy application on device and simulator successfully.

Hence, Closing this issue. Please feel free to reopen If you experience it again.

Thank!