Bug 14541 - Cannot debug or run on device MT000
Summary: Cannot debug or run on device MT000
Status: RESOLVED FIXED
Alias: None
Product: Visual Studio Extensions
Classification: Xamarin
Component: Debugger ()
Version: 1.3.x
Hardware: PC Windows
: --- normal
Target Milestone: ---
Assignee: Vinicius Jarina
URL:
Depends on:
Blocks:
 
Reported: 2013-09-08 18:13 UTC by Brian Chance
Modified: 2016-05-10 17:03 UTC (History)
10 users (show)

Tags:
Is this bug a regression?: ---
Last known good build:


Attachments
mtbserver log from Case #47174 (3.98 KB, application/octet-stream)
2013-09-24 13:35 UTC, Allie Miller
Details
Log from Case #47174 (3.80 KB, application/octet-stream)
2013-09-24 13:35 UTC, Allie Miller
Details
Source code and packages (5.29 MB, application/x-zip-compressed)
2013-11-08 08:53 UTC, Brian Chance
Details


Notice (2018-05-24): bugzilla.xamarin.com is now in read-only mode.

Please join us on Visual Studio Developer Community and in the Xamarin and Mono organizations on GitHub to continue tracking issues. Bugzilla will remain available for reference in read-only mode. We will continue to work on open Bugzilla bugs, copy them to the new locations as needed for follow-up, and add the new items under Related Links.

Our sincere thanks to everyone who has contributed on this bug tracker over the years. Thanks also for your understanding as we make these adjustments and improvements for the future.


Please create a new report on Developer Community with your current version information, steps to reproduce, and relevant error messages or log files if you are hitting an issue that looks similar to this resolved bug and you do not yet see a matching new report.

Related Links:
Status:
RESOLVED FIXED

Description Brian Chance 2013-09-08 18:13:41 UTC
I am getting an error when trying to run on my physical device ( I get 2 errors), runs fine on the simulator...

C:\Program Files (x86)\MSBuild\Xamarin\iOS\Xamarin.MonoTouch.Common.targets(156,3): error : Remote build step failed. [C:\code\StoreFinancial\Dev\Users\Brian\Src\Mobile\CardSpotMobile.Touch\CardSpotMobile.Touch.csproj]
C:\Program Files (x86)\MSBuild\Xamarin\iOS\Xamarin.MonoTouch.Common.targets(156,3): error : Response status: Error [C:\code\StoreFinancial\Dev\Users\Brian\Src\Mobile\CardSpotMobile.Touch\CardSpotMobile.Touch.csproj]
C:\Program Files (x86)\MSBuild\Xamarin\iOS\Xamarin.MonoTouch.Common.targets(156,3): error : error MT0000: Unexpected error - Please file a bug report at http://bugzilla.xamarin.com [C:\code\StoreFinancial\Dev\Users\Brian\Src\Mobile\CardSpotMobile.Touch\CardSpotMobile.Touch.csproj]
C:\Program Files (x86)\MSBuild\Xamarin\iOS\Xamarin.MonoTouch.Common.targets(156,3): error : System.ArgumentOutOfRangeException: Argument is out of range. [C:\code\StoreFinancial\Dev\Users\Brian\Src\Mobile\CardSpotMobile.Touch\CardSpotMobile.Touch.csproj]
C:\Program Files (x86)\MSBuild\Xamarin\iOS\Xamarin.MonoTouch.Common.targets(156,3): error :   at Mono.Collections.Generic.Collection`1[Mono.Cecil.Cil.VariableDefinition].get_Item (Int32 index) [0x00000] in <filename unknown>:0  [C:\code\StoreFinancial\Dev\Users\Brian\Src\Mobile\CardSpotMobile.Touch\CardSpotMobile.Touch.csproj]
C:\Program Files (x86)\MSBuild\Xamarin\iOS\Xamarin.MonoTouch.Common.targets(156,3): error :   at Mono.Cecil.Mdb.MdbReader.ReadLocalVariables (Mono.CompilerServices.SymbolWriter.MethodEntry entry, Mono.Cecil.Cil.MethodSymbols symbols) [0x00000] in <filename unknown>:0  [C:\code\StoreFinancial\Dev\Users\Brian\Src\Mobile\CardSpotMobile.Touch\CardSpotMobile.Touch.csproj]
C:\Program Files (x86)\MSBuild\Xamarin\iOS\Xamarin.MonoTouch.Common.targets(156,3): error :   at Mono.Cecil.Mdb.MdbReader.Read (Mono.Cecil.Cil.MethodSymbols symbols) [0x00000] in <filename unknown>:0  [C:\code\StoreFinancial\Dev\Users\Brian\Src\Mobile\CardSpotMobile.Touch\CardSpotMobile.Touch.csproj]
C:\Program Files (x86)\MSBuild\Xamarin\iOS\Xamarin.MonoTouch.Common.targets(156,3): error :   at Mono.Cecil.Cil.CodeReader.PatchRawMethodBody (Mono.Cecil.MethodDefinition method, Mono.Cecil.Cil.CodeWriter writer, Mono.Cecil.Cil.MethodSymbols& symbols) [0x00000] in <filename unknown>:0  [C:\code\StoreFinancial\Dev\Users\Brian\Src\Mobile\CardSpotMobile.Touch\CardSpotMobile.Touch.csproj]
C:\Program Files (x86)\MSBuild\Xamarin\iOS\Xamarin.MonoTouch.Common.targets(156,3): error :   at Mono.Cecil.Cil.CodeWriter.WriteUnresolvedMethodBody (Mono.Cecil.MethodDefinition method) [0x00000] in <filename unknown>:0  [C:\code\StoreFinancial\Dev\Users\Brian\Src\Mobile\CardSpotMobile.Touch\CardSpotMobile.Touch.csproj]
C:\Program Files (x86)\MSBuild\Xamarin\iOS\Xamarin.MonoTouch.Common.targets(156,3): error :   at Mono.Cecil.Cil.CodeWriter.WriteMethodBody (Mono.Cecil.MethodDefinition method) [0x00000] in <filename unknown>:0  [C:\code\StoreFinancial\Dev\Users\Brian\Src\Mobile\CardSpotMobile.Touch\CardSpotMobile.Touch.csproj]
C:\Program Files (x86)\MSBuild\Xamarin\iOS\Xamarin.MonoTouch.Common.targets(156,3): error :   at Mono.Cecil.MetadataBuilder.AddMethod (Mono.Cecil.MethodDefinition method) [0x00000] in <filename unknown>:0  [C:\code\StoreFinancial\Dev\Users\Brian\Src\Mobile\CardSpotMobile.Touch\CardSpotMobile.Touch.csproj]
C:\Program Files (x86)\MSBuild\Xamarin\iOS\Xamarin.MonoTouch.Common.targets(156,3): error :   at Mono.Cecil.MetadataBuilder.AddMethods (Mono.Cecil.TypeDefinition type) [0x00000] in <filename unknown>:0  [C:\code\StoreFinancial\Dev\Users\Brian\Src\Mobile\CardSpotMobile.Touch\CardSpotMobile.Touch.csproj]
C:\Program Files (x86)\MSBuild\Xamarin\iOS\Xamarin.MonoTouch.Common.targets(156,3): error :   at Mono.Cecil.MetadataBuilder.AddType (Mono.Cecil.TypeDefinition type) [0x00000] in <filename unknown>:0  [C:\code\StoreFinancial\Dev\Users\Brian\Src\Mobile\CardSpotMobile.Touch\CardSpotMobile.Touch.csproj]
C:\Program Files (x86)\MSBuild\Xamarin\iOS\Xamarin.MonoTouch.Common.targets(156,3): error :   at Mono.Cecil.MetadataBuilder.AddTypeDefs () [0x00000] in <filename unknown>:0  [C:\code\StoreFinancial\Dev\Users\Brian\Src\Mobile\CardSpotMobile.Touch\CardSpotMobile.Touch.csproj]
C:\Program Files (x86)\MSBuild\Xamarin\iOS\Xamarin.MonoTouch.Common.targets(156,3): error :   at Mono.Cecil.MetadataBuilder.BuildTypes () [0x00000] in <filename unknown>:0  [C:\code\StoreFinancial\Dev\Users\Brian\Src\Mobile\CardSpotMobile.Touch\CardSpotMobile.Touch.csproj]
C:\Program Files (x86)\MSBuild\Xamarin\iOS\Xamarin.MonoTouch.Common.targets(156,3): error :   at Mono.Cecil.MetadataBuilder.BuildModule () [0x00000] in <filename unknown>:0  [C:\code\StoreFinancial\Dev\Users\Brian\Src\Mobile\CardSpotMobile.Touch\CardSpotMobile.Touch.csproj]
C:\Program Files (x86)\MSBuild\Xamarin\iOS\Xamarin.MonoTouch.Common.targets(156,3): error :   at Mono.Cecil.MetadataBuilder.BuildMetadata () [0x00000] in <filename unknown>:0  [C:\code\StoreFinancial\Dev\Users\Brian\Src\Mobile\CardSpotMobile.Touch\CardSpotMobile.Touch.csproj]
C:\Program Files (x86)\MSBuild\Xamarin\iOS\Xamarin.MonoTouch.Common.targets(156,3): error :   at Mono.Cecil.ModuleWriter.<BuildMetadata>m__18 (Mono.Cecil.MetadataBuilder builder, Mono.Cecil.MetadataReader _) [0x00000] in <filename unknown>:0  [C:\code\StoreFinancial\Dev\Users\Brian\Src\Mobile\CardSpotMobile.Touch\CardSpotMobile.Touch.csproj]
C:\Program Files (x86)\MSBuild\Xamarin\iOS\Xamarin.MonoTouch.Common.targets(156,3): error :   at Mono.Cecil.ModuleDefinition.Read[MetadataBuilder,MetadataBuilder] (Mono.Cecil.MetadataBuilder item, System.Func`3 read) [0x00000] in <filename unknown>:0  [C:\code\StoreFinancial\Dev\Users\Brian\Src\Mobile\CardSpotMobile.Touch\CardSpotMobile.Touch.csproj]
C:\Program Files (x86)\MSBuild\Xamarin\iOS\Xamarin.MonoTouch.Common.targets(156,3): error :   at Mono.Cecil.ModuleWriter.BuildMetadata (Mono.Cecil.ModuleDefinition module, Mono.Cecil.MetadataBuilder metadata) [0x00000] in <filename unknown>:0  [C:\code\StoreFinancial\Dev\Users\Brian\Src\Mobile\CardSpotMobile.Touch\CardSpotMobile.Touch.csproj]
C:\Program Files (x86)\MSBuild\Xamarin\iOS\Xamarin.MonoTouch.Common.targets(156,3): error :   at Mono.Cecil.ModuleWriter.WriteModuleTo (Mono.Cecil.ModuleDefinition module, System.IO.Stream stream, Mono.Cecil.WriterParameters parameters) [0x00000] in <filename unknown>:0  [C:\code\StoreFinancial\Dev\Users\Brian\Src\Mobile\CardSpotMobile.Touch\CardSpotMobile.Touch.csproj]
C:\Program Files (x86)\MSBuild\Xamarin\iOS\Xamarin.MonoTouch.Common.targets(156,3): error :   at Mono.Cecil.ModuleDefinition.Write (System.IO.Stream stream, Mono.Cecil.WriterParameters parameters) [0x00000] in <filename unknown>:0  [C:\code\StoreFinancial\Dev\Users\Brian\Src\Mobile\CardSpotMobile.Touch\CardSpotMobile.Touch.csproj]
C:\Program Files (x86)\MSBuild\Xamarin\iOS\Xamarin.MonoTouch.Common.targets(156,3): error :   at Mono.Cecil.ModuleDefinition.Write (System.String fileName, Mono.Cecil.WriterParameters parameters) [0x00000] in <filename unknown>:0  [C:\code\StoreFinancial\Dev\Users\Brian\Src\Mobile\CardSpotMobile.Touch\CardSpotMobile.Touch.csproj]
C:\Program Files (x86)\MSBuild\Xamarin\iOS\Xamarin.MonoTouch.Common.targets(156,3): error :   at Mono.Cecil.AssemblyDefinition.Write (System.String fileName, Mono.Cecil.WriterParameters parameters) [0x00000] in <filename unknown>:0  [C:\code\StoreFinancial\Dev\Users\Brian\Src\Mobile\CardSpotMobile.Touch\CardSpotMobile.Touch.csproj]
C:\Program Files (x86)\MSBuild\Xamarin\iOS\Xamarin.MonoTouch.Common.targets(156,3): error :   at MTouch.SaveAssembly (Mono.Cecil.AssemblyDefinition assembly, System.String destination) [0x00000] in <filename unknown>:0  [C:\code\StoreFinancial\Dev\Users\Brian\Src\Mobile\CardSpotMobile.Touch\CardSpotMobile.Touch.csproj]
C:\Program Files (x86)\MSBuild\Xamarin\iOS\Xamarin.MonoTouch.Common.targets(156,3): error :   at MonoTouch.Assembly.RemoveResources (Boolean remove_resources, System.String target_directory) [0x00000] in <filename unknown>:0  [C:\code\StoreFinancial\Dev\Users\Brian\Src\Mobile\CardSpotMobile.Touch\CardSpotMobile.Touch.csproj]
C:\Program Files (x86)\MSBuild\Xamarin\iOS\Xamarin.MonoTouch.Common.targets(156,3): error :   at MonoTouch.Application.ProcessAssemblies () [0x00000] in <filename unknown>:0  [C:\code\StoreFinancial\Dev\Users\Brian\Src\Mobile\CardSpotMobile.Touch\CardSpotMobile.Touch.csproj]
C:\Program Files (x86)\MSBuild\Xamarin\iOS\Xamarin.MonoTouch.Common.targets(156,3): error :   at MonoTouch.Application.BuildApp () [0x00000] in <filename unknown>:0  [C:\code\StoreFinancial\Dev\Users\Brian\Src\Mobile\CardSpotMobile.Touch\CardSpotMobile.Touch.csproj]
C:\Program Files (x86)\MSBuild\Xamarin\iOS\Xamarin.MonoTouch.Common.targets(156,3): error :   at MonoTouch.Application.Build () [0x00000] in <filename unknown>:0  [C:\code\StoreFinancial\Dev\Users\Brian\Src\Mobile\CardSpotMobile.Touch\CardSpotMobile.Touch.csproj]
C:\Program Files (x86)\MSBuild\Xamarin\iOS\Xamarin.MonoTouch.Common.targets(156,3): error :   at MTouch.Main2 (System.String[] args) [0x00000] in <filename unknown>:0  [C:\code\StoreFinancial\Dev\Users\Brian\Src\Mobile\CardSpotMobile.Touch\CardSpotMobile.Touch.csproj]
C:\Program Files (x86)\MSBuild\Xamarin\iOS\Xamarin.MonoTouch.Common.targets(156,3): error :   at MTouch.Main (System.String[] args) [0x00000] in <filename unknown>:0  [C:\code\StoreFinancial\Dev\Users\Brian\Src\Mobile\CardSpotMobile.Touch\CardSpotMobile.Touch.csproj]
C:\Program Files (x86)\MSBuild\Xamarin\iOS\Xamarin.MonoTouch.Common.targets(156,3): error :  [C:\code\StoreFinancial\Dev\Users\Brian\Src\Mobile\CardSpotMobile.Touch\CardSpotMobile.Touch.csproj]
C:\Program Files (x86)\MSBuild\Xamarin\iOS\Xamarin.MonoTouch.Common.targets(156,3): error :  [C:\code\StoreFinancial\Dev\Users\Brian\Src\Mobile\CardSpotMobile.Touch\CardSpotMobile.Touch.csproj]
C:\Program Files (x86)\MSBuild\Xamarin\iOS\Xamarin.MonoTouch.Common.targets(156,3): error : Remote build step failed. [C:\code\StoreFinancial\Dev\Users\Brian\Src\Mobile\CardSpotMobile.Touch\CardSpotMobile.Touch.csproj]
Done Building Project "C:\code\StoreFinancial\Dev\Users\Brian\Src\Mobile\CardSpotMobile.Touch\CardSpotMobile.Touch.csproj" (_RemoteBuild target(s)) -- FAILED.

Build FAILED.

"C:\code\StoreFinancial\Dev\Users\Brian\Src\Mobile\CardSpotMobile.Touch\CardSpotMobile.Touch.csproj" (_RemoteBuild target) (1) ->
(_BuildNativeApplication target) -> 
  C:\Program Files (x86)\MSBuild\Xamarin\iOS\Xamarin.MonoTouch.Common.targets(156,3): error : Remote build step failed. [C:\code\StoreFinancial\Dev\Users\Brian\Src\Mobile\CardSpotMobile.Touch\CardSpotMobile.Touch.csproj]
C:\Program Files (x86)\MSBuild\Xamarin\iOS\Xamarin.MonoTouch.Common.targets(156,3): error : Response status: Error [C:\code\StoreFinancial\Dev\Users\Brian\Src\Mobile\CardSpotMobile.Touch\CardSpotMobile.Touch.csproj]
C:\Program Files (x86)\MSBuild\Xamarin\iOS\Xamarin.MonoTouch.Common.targets(156,3): error : error MT0000: Unexpected error - Please file a bug report at http://bugzilla.xamarin.com [C:\code\StoreFinancial\Dev\Users\Brian\Src\Mobile\CardSpotMobile.Touch\CardSpotMobile.Touch.csproj]
C:\Program Files (x86)\MSBuild\Xamarin\iOS\Xamarin.MonoTouch.Common.targets(156,3): error : System.ArgumentOutOfRangeException: Argument is out of range. [C:\code\StoreFinancial\Dev\Users\Brian\Src\Mobile\CardSpotMobile.Touch\CardSpotMobile.Touch.csproj]
C:\Program Files (x86)\MSBuild\Xamarin\iOS\Xamarin.MonoTouch.Common.targets(156,3): error :   at Mono.Collections.Generic.Collection`1[Mono.Cecil.Cil.VariableDefinition].get_Item (Int32 index) [0x00000] in <filename unknown>:0  [C:\code\StoreFinancial\Dev\Users\Brian\Src\Mobile\CardSpotMobile.Touch\CardSpotMobile.Touch.csproj]
C:\Program Files (x86)\MSBuild\Xamarin\iOS\Xamarin.MonoTouch.Common.targets(156,3): error :   at Mono.Cecil.Mdb.MdbReader.ReadLocalVariables (Mono.CompilerServices.SymbolWriter.MethodEntry entry, Mono.Cecil.Cil.MethodSymbols symbols) [0x00000] in <filename unknown>:0  [C:\code\StoreFinancial\Dev\Users\Brian\Src\Mobile\CardSpotMobile.Touch\CardSpotMobile.Touch.csproj]
C:\Program Files (x86)\MSBuild\Xamarin\iOS\Xamarin.MonoTouch.Common.targets(156,3): error :   at Mono.Cecil.Mdb.MdbReader.Read (Mono.Cecil.Cil.MethodSymbols symbols) [0x00000] in <filename unknown>:0  [C:\code\StoreFinancial\Dev\Users\Brian\Src\Mobile\CardSpotMobile.Touch\CardSpotMobile.Touch.csproj]
C:\Program Files (x86)\MSBuild\Xamarin\iOS\Xamarin.MonoTouch.Common.targets(156,3): error :   at Mono.Cecil.Cil.CodeReader.PatchRawMethodBody (Mono.Cecil.MethodDefinition method, Mono.Cecil.Cil.CodeWriter writer, Mono.Cecil.Cil.MethodSymbols& symbols) [0x00000] in <filename unknown>:0  [C:\code\StoreFinancial\Dev\Users\Brian\Src\Mobile\CardSpotMobile.Touch\CardSpotMobile.Touch.csproj]
C:\Program Files (x86)\MSBuild\Xamarin\iOS\Xamarin.MonoTouch.Common.targets(156,3): error :   at Mono.Cecil.Cil.CodeWriter.WriteUnresolvedMethodBody (Mono.Cecil.MethodDefinition method) [0x00000] in <filename unknown>:0  [C:\code\StoreFinancial\Dev\Users\Brian\Src\Mobile\CardSpotMobile.Touch\CardSpotMobile.Touch.csproj]
C:\Program Files (x86)\MSBuild\Xamarin\iOS\Xamarin.MonoTouch.Common.targets(156,3): error :   at Mono.Cecil.Cil.CodeWriter.WriteMethodBody (Mono.Cecil.MethodDefinition method) [0x00000] in <filename unknown>:0  [C:\code\StoreFinancial\Dev\Users\Brian\Src\Mobile\CardSpotMobile.Touch\CardSpotMobile.Touch.csproj]
C:\Program Files (x86)\MSBuild\Xamarin\iOS\Xamarin.MonoTouch.Common.targets(156,3): error :   at Mono.Cecil.MetadataBuilder.AddMethod (Mono.Cecil.MethodDefinition method) [0x00000] in <filename unknown>:0  [C:\code\StoreFinancial\Dev\Users\Brian\Src\Mobile\CardSpotMobile.Touch\CardSpotMobile.Touch.csproj]
C:\Program Files (x86)\MSBuild\Xamarin\iOS\Xamarin.MonoTouch.Common.targets(156,3): error :   at Mono.Cecil.MetadataBuilder.AddMethods (Mono.Cecil.TypeDefinition type) [0x00000] in <filename unknown>:0  [C:\code\StoreFinancial\Dev\Users\Brian\Src\Mobile\CardSpotMobile.Touch\CardSpotMobile.Touch.csproj]
C:\Program Files (x86)\MSBuild\Xamarin\iOS\Xamarin.MonoTouch.Common.targets(156,3): error :   at Mono.Cecil.MetadataBuilder.AddType (Mono.Cecil.TypeDefinition type) [0x00000] in <filename unknown>:0  [C:\code\StoreFinancial\Dev\Users\Brian\Src\Mobile\CardSpotMobile.Touch\CardSpotMobile.Touch.csproj]
C:\Program Files (x86)\MSBuild\Xamarin\iOS\Xamarin.MonoTouch.Common.targets(156,3): error :   at Mono.Cecil.MetadataBuilder.AddTypeDefs () [0x00000] in <filename unknown>:0  [C:\code\StoreFinancial\Dev\Users\Brian\Src\Mobile\CardSpotMobile.Touch\CardSpotMobile.Touch.csproj]
C:\Program Files (x86)\MSBuild\Xamarin\iOS\Xamarin.MonoTouch.Common.targets(156,3): error :   at Mono.Cecil.MetadataBuilder.BuildTypes () [0x00000] in <filename unknown>:0  [C:\code\StoreFinancial\Dev\Users\Brian\Src\Mobile\CardSpotMobile.Touch\CardSpotMobile.Touch.csproj]
C:\Program Files (x86)\MSBuild\Xamarin\iOS\Xamarin.MonoTouch.Common.targets(156,3): error :   at Mono.Cecil.MetadataBuilder.BuildModule () [0x00000] in <filename unknown>:0  [C:\code\StoreFinancial\Dev\Users\Brian\Src\Mobile\CardSpotMobile.Touch\CardSpotMobile.Touch.csproj]
C:\Program Files (x86)\MSBuild\Xamarin\iOS\Xamarin.MonoTouch.Common.targets(156,3): error :   at Mono.Cecil.MetadataBuilder.BuildMetadata () [0x00000] in <filename unknown>:0  [C:\code\StoreFinancial\Dev\Users\Brian\Src\Mobile\CardSpotMobile.Touch\CardSpotMobile.Touch.csproj]
C:\Program Files (x86)\MSBuild\Xamarin\iOS\Xamarin.MonoTouch.Common.targets(156,3): error :   at Mono.Cecil.ModuleWriter.<BuildMetadata>m__18 (Mono.Cecil.MetadataBuilder builder, Mono.Cecil.MetadataReader _) [0x00000] in <filename unknown>:0  [C:\code\StoreFinancial\Dev\Users\Brian\Src\Mobile\CardSpotMobile.Touch\CardSpotMobile.Touch.csproj]
C:\Program Files (x86)\MSBuild\Xamarin\iOS\Xamarin.MonoTouch.Common.targets(156,3): error :   at Mono.Cecil.ModuleDefinition.Read[MetadataBuilder,MetadataBuilder] (Mono.Cecil.MetadataBuilder item, System.Func`3 read) [0x00000] in <filename unknown>:0  [C:\code\StoreFinancial\Dev\Users\Brian\Src\Mobile\CardSpotMobile.Touch\CardSpotMobile.Touch.csproj]
C:\Program Files (x86)\MSBuild\Xamarin\iOS\Xamarin.MonoTouch.Common.targets(156,3): error :   at Mono.Cecil.ModuleWriter.BuildMetadata (Mono.Cecil.ModuleDefinition module, Mono.Cecil.MetadataBuilder metadata) [0x00000] in <filename unknown>:0  [C:\code\StoreFinancial\Dev\Users\Brian\Src\Mobile\CardSpotMobile.Touch\CardSpotMobile.Touch.csproj]
C:\Program Files (x86)\MSBuild\Xamarin\iOS\Xamarin.MonoTouch.Common.targets(156,3): error :   at Mono.Cecil.ModuleWriter.WriteModuleTo (Mono.Cecil.ModuleDefinition module, System.IO.Stream stream, Mono.Cecil.WriterParameters parameters) [0x00000] in <filename unknown>:0  [C:\code\StoreFinancial\Dev\Users\Brian\Src\Mobile\CardSpotMobile.Touch\CardSpotMobile.Touch.csproj]
C:\Program Files (x86)\MSBuild\Xamarin\iOS\Xamarin.MonoTouch.Common.targets(156,3): error :   at Mono.Cecil.ModuleDefinition.Write (System.IO.Stream stream, Mono.Cecil.WriterParameters parameters) [0x00000] in <filename unknown>:0  [C:\code\StoreFinancial\Dev\Users\Brian\Src\Mobile\CardSpotMobile.Touch\CardSpotMobile.Touch.csproj]
C:\Program Files (x86)\MSBuild\Xamarin\iOS\Xamarin.MonoTouch.Common.targets(156,3): error :   at Mono.Cecil.ModuleDefinition.Write (System.String fileName, Mono.Cecil.WriterParameters parameters) [0x00000] in <filename unknown>:0  [C:\code\StoreFinancial\Dev\Users\Brian\Src\Mobile\CardSpotMobile.Touch\CardSpotMobile.Touch.csproj]
C:\Program Files (x86)\MSBuild\Xamarin\iOS\Xamarin.MonoTouch.Common.targets(156,3): error :   at Mono.Cecil.AssemblyDefinition.Write (System.String fileName, Mono.Cecil.WriterParameters parameters) [0x00000] in <filename unknown>:0  [C:\code\StoreFinancial\Dev\Users\Brian\Src\Mobile\CardSpotMobile.Touch\CardSpotMobile.Touch.csproj]
C:\Program Files (x86)\MSBuild\Xamarin\iOS\Xamarin.MonoTouch.Common.targets(156,3): error :   at MTouch.SaveAssembly (Mono.Cecil.AssemblyDefinition assembly, System.String destination) [0x00000] in <filename unknown>:0  [C:\code\StoreFinancial\Dev\Users\Brian\Src\Mobile\CardSpotMobile.Touch\CardSpotMobile.Touch.csproj]
C:\Program Files (x86)\MSBuild\Xamarin\iOS\Xamarin.MonoTouch.Common.targets(156,3): error :   at MonoTouch.Assembly.RemoveResources (Boolean remove_resources, System.String target_directory) [0x00000] in <filename unknown>:0  [C:\code\StoreFinancial\Dev\Users\Brian\Src\Mobile\CardSpotMobile.Touch\CardSpotMobile.Touch.csproj]
C:\Program Files (x86)\MSBuild\Xamarin\iOS\Xamarin.MonoTouch.Common.targets(156,3): error :   at MonoTouch.Application.ProcessAssemblies () [0x00000] in <filename unknown>:0  [C:\code\StoreFinancial\Dev\Users\Brian\Src\Mobile\CardSpotMobile.Touch\CardSpotMobile.Touch.csproj]
C:\Program Files (x86)\MSBuild\Xamarin\iOS\Xamarin.MonoTouch.Common.targets(156,3): error :   at MonoTouch.Application.BuildApp () [0x00000] in <filename unknown>:0  [C:\code\StoreFinancial\Dev\Users\Brian\Src\Mobile\CardSpotMobile.Touch\CardSpotMobile.Touch.csproj]
C:\Program Files (x86)\MSBuild\Xamarin\iOS\Xamarin.MonoTouch.Common.targets(156,3): error :   at MonoTouch.Application.Build () [0x00000] in <filename unknown>:0  [C:\code\StoreFinancial\Dev\Users\Brian\Src\Mobile\CardSpotMobile.Touch\CardSpotMobile.Touch.csproj]
C:\Program Files (x86)\MSBuild\Xamarin\iOS\Xamarin.MonoTouch.Common.targets(156,3): error :   at MTouch.Main2 (System.String[] args) [0x00000] in <filename unknown>:0  [C:\code\StoreFinancial\Dev\Users\Brian\Src\Mobile\CardSpotMobile.Touch\CardSpotMobile.Touch.csproj]
C:\Program Files (x86)\MSBuild\Xamarin\iOS\Xamarin.MonoTouch.Common.targets(156,3): error :   at MTouch.Main (System.String[] args) [0x00000] in <filename unknown>:0  [C:\code\StoreFinancial\Dev\Users\Brian\Src\Mobile\CardSpotMobile.Touch\CardSpotMobile.Touch.csproj]
C:\Program Files (x86)\MSBuild\Xamarin\iOS\Xamarin.MonoTouch.Common.targets(156,3): error :  [C:\code\StoreFinancial\Dev\Users\Brian\Src\Mobile\CardSpotMobile.Touch\CardSpotMobile.Touch.csproj]
C:\Program Files (x86)\MSBuild\Xamarin\iOS\Xamarin.MonoTouch.Common.targets(156,3): error :  [C:\code\StoreFinancial\Dev\Users\Brian\Src\Mobile\CardSpotMobile.Touch\CardSpotMobile.Touch.csproj]
  C:\Program Files (x86)\MSBuild\Xamarin\iOS\Xamarin.MonoTouch.Common.targets(156,3): error : Remote build step failed. [C:\code\StoreFinancial\Dev\Users\Brian\Src\Mobile\CardSpotMobile.Touch\CardSpotMobile.Touch.csproj]
Comment 1 Brian Chance 2013-09-08 18:30:11 UTC
I can debug the same project on Xamarin Studio. This started after updating XS to 6.4.4.12 and synchronizing the SDK on VS.

Before the XS update, VS kept asking to sync the SDK, but I had not update either XS or VS.
Comment 4 Allie Miller 2013-09-24 13:35:13 UTC
Created attachment 4979 [details]
mtbserver log from Case #47174
Comment 5 Allie Miller 2013-09-24 13:35:46 UTC
Created attachment 4980 [details]
Log from Case #47174
Comment 6 Vinicius Jarina 2013-10-07 14:33:12 UTC
What is the iOS for VS version?

Is this happening only for one project? or for all projects?

Thank you.
Comment 7 Alan McGovern 2013-11-07 19:26:35 UTC
This is an issue with the linker which could be specific to your project. Can you provide a copy of the solution (and it's dependencies) for us to test with?
Comment 8 Brian Chance 2013-11-08 08:53:18 UTC
Created attachment 5370 [details]
Source code and packages
Comment 9 Alan McGovern 2013-11-14 11:57:33 UTC
Your issue appears to have been fixed in the latest release. There was a known issue where the wrong assemblies were sometimes sent to the iOS simulator which could trigger this kind of problem.

If you still have issues launching applications in the simulator you should click on the 'Reset Simulator Content and Settings' in the iOS Simulator menu. This will clear out any problematic files which were left over from previous deployment attempts.
Comment 10 Brian Chance 2013-11-14 12:22:41 UTC
Great! Thank you.