Bug 12920 - Can't run project on iPhone - fails with ArgumentOutOfRangeException
Summary: Can't run project on iPhone - fails with ArgumentOutOfRangeException
Status: VERIFIED FIXED
Alias: None
Product: Visual Studio Extensions
Classification: Xamarin
Component: Debugger ()
Version: 0.x Insider Preview
Hardware: PC Windows
: Normal major
Target Milestone: ---
Assignee: Jose Miguel Torres
URL:
Depends on:
Blocks:
 
Reported: 2013-06-27 13:42 UTC by calvin.fisher
Modified: 2016-05-10 17:05 UTC (History)
14 users (show)

Tags:
Is this bug a regression?: ---
Last known good build:


Attachments
Visual Studio log of ArgumentOutOfRangeException (42.27 KB, text/plain)
2013-09-12 14:26 UTC, Doug G
Details
Xamarin Studio log of native linking failure (50.89 KB, text/plain)
2013-09-12 14:27 UTC, Doug G
Details
Files in C:\Program Files (x86)\Reference Assemblies\Microsoft\Framework\MonoTouch\v4.0 (244.22 KB, image/png)
2013-09-13 10:09 UTC, Doug G
Details
Hello World App that had the issue in August (70.78 KB, application/octet-stream)
2013-09-16 10:51 UTC, Michael James
Details


Notice (2018-05-24): bugzilla.xamarin.com is now in read-only mode.

Please join us on Visual Studio Developer Community and in the Xamarin and Mono organizations on GitHub to continue tracking issues. Bugzilla will remain available for reference in read-only mode. We will continue to work on open Bugzilla bugs, copy them to the new locations as needed for follow-up, and add the new items under Related Links.

Our sincere thanks to everyone who has contributed on this bug tracker over the years. Thanks also for your understanding as we make these adjustments and improvements for the future.


Please create a new report on Developer Community with your current version information, steps to reproduce, and relevant error messages or log files if you are hitting an issue that looks similar to this resolved bug and you do not yet see a matching new report.

Related Links:
Status:
VERIFIED FIXED

Description calvin.fisher 2013-06-27 13:42:20 UTC
I've been debugging my project on the iOS simulator without issue and it has worked on the iPhone in the past.  But now, when I try to Start Debugging or Start Without Debugging, it encounters the error below.

The Mac build server appears to be fine. The phone is connected and detected in XCode and appears in the Visual Studio build target drop-down.

Running beta branch of Xamarin libraries and plugins, all up to date.


Build FAILED.

"C:\TFS\MyProject\MyProject.csproj" (_RemoteBuild target) (1) ->
(_BuildNativeApplication target) -> 
  C:\Program Files (x86)\MSBuild\Xamarin\iOS\Xamarin.MonoTouch.Common.targets(155,3): error : Remote build step failed. [C:\TFS\MyProject\MyProject.csproj]
C:\Program Files (x86)\MSBuild\Xamarin\iOS\Xamarin.MonoTouch.Common.targets(155,3): error : Response status: Error [C:\TFS\MyProject\MyProject.csproj]
C:\Program Files (x86)\MSBuild\Xamarin\iOS\Xamarin.MonoTouch.Common.targets(155,3): error : error MT0000: Unexpected error - Please file a bug report at http://bugzilla.xamarin.com [C:\TFS\MyProject\MyProject.csproj]
C:\Program Files (x86)\MSBuild\Xamarin\iOS\Xamarin.MonoTouch.Common.targets(155,3): error : System.ArgumentOutOfRangeException: Argument is out of range. [C:\TFS\MyProject\MyProject.csproj]
C:\Program Files (x86)\MSBuild\Xamarin\iOS\Xamarin.MonoTouch.Common.targets(155,3): error :   at Mono.Collections.Generic.Collection`1[Mono.Cecil.Cil.VariableDefinition].get_Item (Int32 index) [0x00000] in <filename unknown>:0  [C:\TFS\MyProject\MyProject.csproj]
C:\Program Files (x86)\MSBuild\Xamarin\iOS\Xamarin.MonoTouch.Common.targets(155,3): error :   at Mono.Cecil.Mdb.MdbReader.ReadLocalVariables (Mono.CompilerServices.SymbolWriter.MethodEntry entry, Mono.Cecil.Cil.MethodSymbols symbols) [0x00000] in <filename unknown>:0  [C:\TFS\MyProject\MyProject.csproj]
C:\Program Files (x86)\MSBuild\Xamarin\iOS\Xamarin.MonoTouch.Common.targets(155,3): error :   at Mono.Cecil.Mdb.MdbReader.Read (Mono.Cecil.Cil.MethodSymbols symbols) [0x00000] in <filename unknown>:0  [C:\TFS\MyProject\MyProject.csproj]
C:\Program Files (x86)\MSBuild\Xamarin\iOS\Xamarin.MonoTouch.Common.targets(155,3): error :   at Mono.Cecil.Cil.CodeReader.PatchRawMethodBody (Mono.Cecil.MethodDefinition method, Mono.Cecil.Cil.CodeWriter writer, Mono.Cecil.Cil.MethodSymbols& symbols) [0x00000] in <filename unknown>:0  [C:\TFS\MyProject\MyProject.csproj]
C:\Program Files (x86)\MSBuild\Xamarin\iOS\Xamarin.MonoTouch.Common.targets(155,3): error :   at Mono.Cecil.Cil.CodeWriter.WriteUnresolvedMethodBody (Mono.Cecil.MethodDefinition method) [0x00000] in <filename unknown>:0  [C:\TFS\MyProject\MyProject.csproj]
C:\Program Files (x86)\MSBuild\Xamarin\iOS\Xamarin.MonoTouch.Common.targets(155,3): error :   at Mono.Cecil.Cil.CodeWriter.WriteMethodBody (Mono.Cecil.MethodDefinition method) [0x00000] in <filename unknown>:0  [C:\TFS\MyProject\MyProject.csproj]
C:\Program Files (x86)\MSBuild\Xamarin\iOS\Xamarin.MonoTouch.Common.targets(155,3): error :   at Mono.Cecil.MetadataBuilder.AddMethod (Mono.Cecil.MethodDefinition method) [0x00000] in <filename unknown>:0  [C:\TFS\MyProject\MyProject.csproj]
C:\Program Files (x86)\MSBuild\Xamarin\iOS\Xamarin.MonoTouch.Common.targets(155,3): error :   at Mono.Cecil.MetadataBuilder.AddMethods (Mono.Cecil.TypeDefinition type) [0x00000] in <filename unknown>:0  [C:\TFS\MyProject\MyProject.csproj]
C:\Program Files (x86)\MSBuild\Xamarin\iOS\Xamarin.MonoTouch.Common.targets(155,3): error :   at Mono.Cecil.MetadataBuilder.AddType (Mono.Cecil.TypeDefinition type) [0x00000] in <filename unknown>:0  [C:\TFS\MyProject\MyProject.csproj]
C:\Program Files (x86)\MSBuild\Xamarin\iOS\Xamarin.MonoTouch.Common.targets(155,3): error :   at Mono.Cecil.MetadataBuilder.AddNestedTypes (Mono.Cecil.TypeDefinition type) [0x00000] in <filename unknown>:0  [C:\TFS\MyProject\MyProject.csproj]
C:\Program Files (x86)\MSBuild\Xamarin\iOS\Xamarin.MonoTouch.Common.targets(155,3): error :   at Mono.Cecil.MetadataBuilder.AddType (Mono.Cecil.TypeDefinition type) [0x00000] in <filename unknown>:0  [C:\TFS\MyProject\MyProject.csproj]
C:\Program Files (x86)\MSBuild\Xamarin\iOS\Xamarin.MonoTouch.Common.targets(155,3): error :   at Mono.Cecil.MetadataBuilder.AddTypeDefs () [0x00000] in <filename unknown>:0  [C:\TFS\MyProject\MyProject.csproj]
C:\Program Files (x86)\MSBuild\Xamarin\iOS\Xamarin.MonoTouch.Common.targets(155,3): error :   at Mono.Cecil.MetadataBuilder.BuildTypes () [0x00000] in <filename unknown>:0  [C:\TFS\MyProject\MyProject.csproj]
C:\Program Files (x86)\MSBuild\Xamarin\iOS\Xamarin.MonoTouch.Common.targets(155,3): error :   at Mono.Cecil.MetadataBuilder.BuildModule () [0x00000] in <filename unknown>:0  [C:\TFS\MyProject\MyProject.csproj]
C:\Program Files (x86)\MSBuild\Xamarin\iOS\Xamarin.MonoTouch.Common.targets(155,3): error :   at Mono.Cecil.MetadataBuilder.BuildMetadata () [0x00000] in <filename unknown>:0  [C:\TFS\MyProject\MyProject.csproj]
C:\Program Files (x86)\MSBuild\Xamarin\iOS\Xamarin.MonoTouch.Common.targets(155,3): error :   at Mono.Cecil.ModuleWriter.<BuildMetadata>m__18 (Mono.Cecil.MetadataBuilder builder, Mono.Cecil.MetadataReader _) [0x00000] in <filename unknown>:0  [C:\TFS\MyProject\MyProject.csproj]
C:\Program Files (x86)\MSBuild\Xamarin\iOS\Xamarin.MonoTouch.Common.targets(155,3): error :   at Mono.Cecil.ModuleDefinition.Read[MetadataBuilder,MetadataBuilder] (Mono.Cecil.MetadataBuilder item, System.Func`3 read) [0x00000] in <filename unknown>:0  [C:\TFS\MyProject\MyProject.csproj]
C:\Program Files (x86)\MSBuild\Xamarin\iOS\Xamarin.MonoTouch.Common.targets(155,3): error :   at Mono.Cecil.ModuleWriter.BuildMetadata (Mono.Cecil.ModuleDefinition module, Mono.Cecil.MetadataBuilder metadata) [0x00000] in <filename unknown>:0  [C:\TFS\MyProject\MyProject.csproj]
C:\Program Files (x86)\MSBuild\Xamarin\iOS\Xamarin.MonoTouch.Common.targets(155,3): error :   at Mono.Cecil.ModuleWriter.WriteModuleTo (Mono.Cecil.ModuleDefinition module, System.IO.Stream stream, Mono.Cecil.WriterParameters parameters) [0x00000] in <filename unknown>:0  [C:\TFS\MyProject\MyProject.csproj]
C:\Program Files (x86)\MSBuild\Xamarin\iOS\Xamarin.MonoTouch.Common.targets(155,3): error :   at Mono.Cecil.ModuleDefinition.Write (System.IO.Stream stream, Mono.Cecil.WriterParameters parameters) [0x00000] in <filename unknown>:0  [C:\TFS\MyProject\MyProject.csproj]
C:\Program Files (x86)\MSBuild\Xamarin\iOS\Xamarin.MonoTouch.Common.targets(155,3): error :   at Mono.Cecil.ModuleDefinition.Write (System.String fileName, Mono.Cecil.WriterParameters parameters) [0x00000] in <filename unknown>:0  [C:\TFS\MyProject\MyProject.csproj]
C:\Program Files (x86)\MSBuild\Xamarin\iOS\Xamarin.MonoTouch.Common.targets(155,3): error :   at Mono.Cecil.AssemblyDefinition.Write (System.String fileName, Mono.Cecil.WriterParameters parameters) [0x00000] in <filename unknown>:0  [C:\TFS\MyProject\MyProject.csproj]
C:\Program Files (x86)\MSBuild\Xamarin\iOS\Xamarin.MonoTouch.Common.targets(155,3): error :   at MTouch.SaveAssembly (Mono.Cecil.AssemblyDefinition assembly, System.String destination) [0x00000] in <filename unknown>:0  [C:\TFS\MyProject\MyProject.csproj]
C:\Program Files (x86)\MSBuild\Xamarin\iOS\Xamarin.MonoTouch.Common.targets(155,3): error :   at MTouch.Main2 (System.String[] args) [0x00000] in <filename unknown>:0  [C:\TFS\MyProject\MyProject.csproj]
C:\Program Files (x86)\MSBuild\Xamarin\iOS\Xamarin.MonoTouch.Common.targets(155,3): error :   at MTouch.Main (System.String[] args) [0x00000] in <filename unknown>:0  [C:\TFS\MyProject\MyProject.csproj]
C:\Program Files (x86)\MSBuild\Xamarin\iOS\Xamarin.MonoTouch.Common.targets(155,3): error :  [C:\TFS\MyProject\MyProject.csproj]
C:\Program Files (x86)\MSBuild\Xamarin\iOS\Xamarin.MonoTouch.Common.targets(155,3): error :  [C:\TFS\MyProject\MyProject.csproj]
  C:\Program Files (x86)\MSBuild\Xamarin\iOS\Xamarin.MonoTouch.Common.targets(155,3): error : Remote build step failed. [C:\TFS\MyProject\MyProject.csproj]

    0 Warning(s)
    2 Error(s)

Time Elapsed 00:00:17.34


The program '[5500] MyProject.vshost.exe: Program Trace' has exited with code 0 (0x0).
The program '[5500] MyProject.vshost.exe: Managed (v4.0.30319)' has exited with code -1 (0xffffffff).
Comment 1 Jose Miguel Torres 2013-06-28 14:29:45 UTC
Hello Calvin,, could you share the exact version of the Xamarin.iOS plugin and Xamarin.iOS on Mac build host you are using? you will find both in About menu.

Thanks!!
Comment 2 calvin.fisher 2013-06-28 14:31:51 UTC
Xamarin.iOS Visual Studio plugin: 1.2.121 (eba1eff3)
Xamarin.iOS: 6.3.6.77 (fa63be7)
Comment 3 Jose Miguel Torres 2013-06-28 14:38:18 UTC
Thanks,

Are you able to compile others projects or it is only happening with this one?
Comment 4 calvin.fisher 2013-07-09 15:21:36 UTC
I created a new Hello World test project, and it does deploy to the device correctly.
Comment 5 Jose Miguel Torres 2013-07-10 09:33:34 UTC
marking it as Fixed. Please let us know if you come across this issue in the future.

Thanks,
Comment 6 calvin.fisher 2013-07-10 16:32:34 UTC
We are still experiencing the issue.  The projects differ, but it's not immediately obvious what the important difference(s) are or how it got that way.  We're not considering that an acceptable situation for the product.
Comment 7 Jose Miguel Torres 2013-07-10 17:02:51 UTC
Could you please send us (attached) the csproj file that is causing the issue?

Thanks
Comment 9 Jose Miguel Torres 2013-07-15 04:00:34 UTC
Hi Calvin,

Looks like the issue is in the Mac build host. Could you attach the ~/Library/Logs/Xamarin/MonoTouchVS/mtbserver.log file just when the issue above is raised?

thanks again,
Comment 11 Michael James 2013-07-19 05:36:40 UTC
Hi guys,

I've had this for a few days as well. Following speaking to support I thought it was going to be fixed in the next release but following today's update I still haven't got deployment working successfully. I got 2 successful deploys this morning and since then it constantly bombs out. Logs below including server log.

Microsoft (R) Build Engine version 4.0.30319.32559
[Microsoft .NET Framework, version 4.0.30319.32559]
Copyright (C) Microsoft Corporation. All rights reserved.

Build started 19/07/2013 10:27:00.
Project "C:\Development\MK Software Solutions\MKS.PMIs\Presentation.iOS\Presentation.iOS.csproj" on node 1 (_RemoteBuild target(s)).
_ResolveAssemblies:
  ResolveAssemblies Task
    ReferenceAssembliesDirectory: C:\Program Files (x86)\Reference Assemblies\Microsoft\Framework\MonoTouch\v4.0\
    I18nAssemblies: 
  Skipping profile assembly: C:\Program Files (x86)\Reference Assemblies\Microsoft\Framework\MonoTouch\v4.0\monotouch.dll
  Skipping profile assembly: C:\Program Files (x86)\Reference Assemblies\Microsoft\Framework\MonoTouch\v4.0\System.dll
  Skipping profile assembly: C:\Program Files (x86)\Reference Assemblies\Microsoft\Framework\MonoTouch\v4.0\MonoTouch.Dialog-1.dll
  Skipping profile assembly: C:\Program Files (x86)\Reference Assemblies\Microsoft\Framework\MonoTouch\v4.0\mscorlib.dll
  Skipping profile assembly: C:\Program Files (x86)\Reference Assemblies\Microsoft\Framework\MonoTouch\v4.0\System.dll
  Skipping profile assembly: C:\Program Files (x86)\Reference Assemblies\Microsoft\Framework\MonoTouch\v4.0\mscorlib.dll
  Skipping profile assembly: C:\Program Files (x86)\Reference Assemblies\Microsoft\Framework\MonoTouch\v4.0\mscorlib.dll
  Skipping profile assembly: C:\Program Files (x86)\Reference Assemblies\Microsoft\Framework\MonoTouch\v4.0\System.dll
  Skipping profile assembly: C:\Program Files (x86)\Reference Assemblies\Microsoft\Framework\MonoTouch\v4.0\System.Core.dll
  Skipping profile assembly: C:\Program Files (x86)\Reference Assemblies\Microsoft\Framework\MonoTouch\v4.0\System.Runtime.Serialization.dll
  Skipping profile assembly: C:\Program Files (x86)\Reference Assemblies\Microsoft\Framework\MonoTouch\v4.0\monotouch.dll
  Skipping profile assembly: C:\Program Files (x86)\Reference Assemblies\Microsoft\Framework\MonoTouch\v4.0\mscorlib.dll
  Skipping profile assembly: C:\Program Files (x86)\Reference Assemblies\Microsoft\Framework\MonoTouch\v4.0\System.dll
  Skipping profile assembly: C:\Program Files (x86)\Reference Assemblies\Microsoft\Framework\MonoTouch\v4.0\System.Core.dll
  Skipping profile assembly: C:\Program Files (x86)\Reference Assemblies\Microsoft\Framework\MonoTouch\v4.0\System.Net.Http.dll
  Skipping profile assembly: C:\Program Files (x86)\Reference Assemblies\Microsoft\Framework\MonoTouch\v4.0\mscorlib.dll
  Skipping profile assembly: C:\Program Files (x86)\Reference Assemblies\Microsoft\Framework\MonoTouch\v4.0\monotouch.dll
  Skipping profile assembly: C:\Program Files (x86)\Reference Assemblies\Microsoft\Framework\MonoTouch\v4.0\System.dll
  Skipping profile assembly: C:\Program Files (x86)\Reference Assemblies\Microsoft\Framework\MonoTouch\v4.0\System.Runtime.Serialization.dll
  Skipping profile assembly: C:\Program Files (x86)\Reference Assemblies\Microsoft\Framework\MonoTouch\v4.0\System.Core.dll
  Skipping profile assembly: C:\Program Files (x86)\Reference Assemblies\Microsoft\Framework\MonoTouch\v4.0\System.Net.Http.dll
  Skipping profile assembly: C:\Program Files (x86)\Reference Assemblies\Microsoft\Framework\MonoTouch\v4.0\mscorlib.dll
  Skipping profile assembly: C:\Program Files (x86)\Reference Assemblies\Microsoft\Framework\MonoTouch\v4.0\monotouch.dll
  Skipping profile assembly: C:\Program Files (x86)\Reference Assemblies\Microsoft\Framework\MonoTouch\v4.0\System.Core.dll
  Skipping profile assembly: C:\Program Files (x86)\Reference Assemblies\Microsoft\Framework\MonoTouch\v4.0\System.ComponentModel.DataAnnotations.dll
  Skipping profile assembly: C:\Program Files (x86)\Reference Assemblies\Microsoft\Framework\MonoTouch\v4.0\mscorlib.dll
  Skipping profile assembly: C:\Program Files (x86)\Reference Assemblies\Microsoft\Framework\MonoTouch\v4.0\monotouch.dll
  Skipping profile assembly: C:\Program Files (x86)\Reference Assemblies\Microsoft\Framework\MonoTouch\v4.0\System.dll
  Skipping profile assembly: C:\Program Files (x86)\Reference Assemblies\Microsoft\Framework\MonoTouch\v4.0\System.Core.dll
    [Output] ResolvedAssemblies:
      C:\Development\MK Software Solutions\MKS.PMIs\Presentation.iOS\bin\iPhone\Debug\MKS.PreventativeMaintenanceInspections.Presentation.iOS.exe
      C:\Development\MK Software Solutions\MKS.PMIs\Presentation.iOS\bin\iPhone\Debug\MKS.PreventativeMaintenanceInspections.Presentation.iOS.pdb
      C:\Development\MK Software Solutions\MKS.PMIs\Presentation.iOS\bin\iPhone\Debug\MKS.PreventativeMaintenanceInspections.BusinessLogic.iOS.dll
      C:\Development\MK Software Solutions\MKS.PMIs\Presentation.iOS\bin\iPhone\Debug\MKS.PreventativeMaintenanceInspections.BusinessLogic.iOS.pdb
      C:\Development\MK Software Solutions\MKS.PMIs\Presentation.iOS\bin\iPhone\Debug\Newtonsoft.Json.dll
      C:\Development\MK Software Solutions\MKS.PMIs\Presentation.iOS\bin\iPhone\Debug\MKS.VehicleCustomerLookup.iOS.dll
      C:\Development\MK Software Solutions\MKS.PMIs\Presentation.iOS\bin\iPhone\Debug\MKS.Mobile.Core.iOS.dll
      C:\Development\MK Software Solutions\MKS.PMIs\Presentation.iOS\bin\iPhone\Debug\Xamarin.Mobile.dll
      C:\Development\MK Software Solutions\MKS.PMIs\Presentation.iOS\bin\iPhone\Debug\MBProgressHUD.dll
      C:\Development\MK Software Solutions\MKS.PMIs\Presentation.iOS\bin\iPhone\Debug\MBProgressHUD.dll.mdb
_GenerateBundleContentDir:
  Preparing application bundle
  Copying file from "C:\Development\MK Software Solutions\MKS.PMIs\Presentation.iOS\bin\iPhone\Debug\MKS.PreventativeMaintenanceInspections.Presentation.iOS.exe" to "C:\Development\MK Software Solutions\MKS.PMIs\Presentation.iOS\obj\iPhone\Debug\build_package\assemblies\MKS.PreventativeMaintenanceInspections.Presentation.iOS.exe".
  Copying file from "C:\Development\MK Software Solutions\MKS.PMIs\Presentation.iOS\bin\iPhone\Debug\MKS.PreventativeMaintenanceInspections.Presentation.iOS.pdb" to "C:\Development\MK Software Solutions\MKS.PMIs\Presentation.iOS\obj\iPhone\Debug\build_package\assemblies\MKS.PreventativeMaintenanceInspections.Presentation.iOS.pdb".
  Copying file from "C:\Development\MK Software Solutions\MKS.PMIs\Presentation.iOS\bin\iPhone\Debug\MKS.PreventativeMaintenanceInspections.BusinessLogic.iOS.dll" to "C:\Development\MK Software Solutions\MKS.PMIs\Presentation.iOS\obj\iPhone\Debug\build_package\assemblies\MKS.PreventativeMaintenanceInspections.BusinessLogic.iOS.dll".
  Copying file from "C:\Development\MK Software Solutions\MKS.PMIs\Presentation.iOS\bin\iPhone\Debug\MKS.PreventativeMaintenanceInspections.BusinessLogic.iOS.pdb" to "C:\Development\MK Software Solutions\MKS.PMIs\Presentation.iOS\obj\iPhone\Debug\build_package\assemblies\MKS.PreventativeMaintenanceInspections.BusinessLogic.iOS.pdb".
  Copying file from "C:\Development\MK Software Solutions\MKS.PMIs\Presentation.iOS\bin\iPhone\Debug\MKS.VehicleCustomerLookup.iOS.dll" to "C:\Development\MK Software Solutions\MKS.PMIs\Presentation.iOS\obj\iPhone\Debug\build_package\assemblies\MKS.VehicleCustomerLookup.iOS.dll".
_BuildNativeApplication:
  Saying hello to the remote server at http://10.10.13.61:49215/
  Fetching manifest...
  Updating information about the remote server
  Uploading changes...
  Synchronizing with the remote server
  Building...
  Building application on the remote server
C:\Program Files (x86)\MSBuild\Xamarin\iOS\Xamarin.MonoTouch.Common.targets(148,3): error : Remote build step failed. [C:\Development\MK Software Solutions\MKS.PMIs\Presentation.iOS\Presentation.iOS.csproj]
C:\Program Files (x86)\MSBuild\Xamarin\iOS\Xamarin.MonoTouch.Common.targets(148,3): error :  [C:\Development\MK Software Solutions\MKS.PMIs\Presentation.iOS\Presentation.iOS.csproj]
C:\Program Files (x86)\MSBuild\Xamarin\iOS\Xamarin.MonoTouch.Common.targets(148,3): error : Remote build step failed. [C:\Development\MK Software Solutions\MKS.PMIs\Presentation.iOS\Presentation.iOS.csproj]
Done Building Project "C:\Development\MK Software Solutions\MKS.PMIs\Presentation.iOS\Presentation.iOS.csproj" (_RemoteBuild target(s)) -- FAILED.

Build FAILED.

"C:\Development\MK Software Solutions\MKS.PMIs\Presentation.iOS\Presentation.iOS.csproj" (_RemoteBuild target) (1) ->
(_BuildNativeApplication target) -> 
  C:\Program Files (x86)\MSBuild\Xamarin\iOS\Xamarin.MonoTouch.Common.targets(148,3): error : Remote build step failed. [C:\Development\MK Software Solutions\MKS.PMIs\Presentation.iOS\Presentation.iOS.csproj]
C:\Program Files (x86)\MSBuild\Xamarin\iOS\Xamarin.MonoTouch.Common.targets(148,3): error :  [C:\Development\MK Software Solutions\MKS.PMIs\Presentation.iOS\Presentation.iOS.csproj]
  C:\Program Files (x86)\MSBuild\Xamarin\iOS\Xamarin.MonoTouch.Common.targets(148,3): error : Remote build step failed. [C:\Development\MK Software Solutions\MKS.PMIs\Presentation.iOS\Presentation.iOS.csproj]

    0 Warning(s)
    2 Error(s)

Time Elapsed 00:01:48.86


Microsoft (R) Build Engine version 4.0.30319.32559
[Microsoft .NET Framework, version 4.0.30319.32559]
Copyright (C) Microsoft Corporation. All rights reserved.

Build started 19/07/2013 10:28:10.
Project "C:\Development\MK Software Solutions\MKS.PMIs\Presentation.iOS\Presentation.iOS.csproj" on node 1 (_RemoteBuild target(s)).
_ResolveAssemblies:
  ResolveAssemblies Task
    ReferenceAssembliesDirectory: C:\Program Files (x86)\Reference Assemblies\Microsoft\Framework\MonoTouch\v4.0\
    I18nAssemblies: 
  Skipping profile assembly: C:\Program Files (x86)\Reference Assemblies\Microsoft\Framework\MonoTouch\v4.0\monotouch.dll
  Skipping profile assembly: C:\Program Files (x86)\Reference Assemblies\Microsoft\Framework\MonoTouch\v4.0\System.dll
  Skipping profile assembly: C:\Program Files (x86)\Reference Assemblies\Microsoft\Framework\MonoTouch\v4.0\MonoTouch.Dialog-1.dll
  Skipping profile assembly: C:\Program Files (x86)\Reference Assemblies\Microsoft\Framework\MonoTouch\v4.0\mscorlib.dll
  Skipping profile assembly: C:\Program Files (x86)\Reference Assemblies\Microsoft\Framework\MonoTouch\v4.0\System.dll
  Skipping profile assembly: C:\Program Files (x86)\Reference Assemblies\Microsoft\Framework\MonoTouch\v4.0\mscorlib.dll
  Skipping profile assembly: C:\Program Files (x86)\Reference Assemblies\Microsoft\Framework\MonoTouch\v4.0\mscorlib.dll
  Skipping profile assembly: C:\Program Files (x86)\Reference Assemblies\Microsoft\Framework\MonoTouch\v4.0\System.dll
  Skipping profile assembly: C:\Program Files (x86)\Reference Assemblies\Microsoft\Framework\MonoTouch\v4.0\System.Core.dll
  Skipping profile assembly: C:\Program Files (x86)\Reference Assemblies\Microsoft\Framework\MonoTouch\v4.0\System.Runtime.Serialization.dll
  Skipping profile assembly: C:\Program Files (x86)\Reference Assemblies\Microsoft\Framework\MonoTouch\v4.0\monotouch.dll
  Skipping profile assembly: C:\Program Files (x86)\Reference Assemblies\Microsoft\Framework\MonoTouch\v4.0\mscorlib.dll
  Skipping profile assembly: C:\Program Files (x86)\Reference Assemblies\Microsoft\Framework\MonoTouch\v4.0\System.dll
  Skipping profile assembly: C:\Program Files (x86)\Reference Assemblies\Microsoft\Framework\MonoTouch\v4.0\System.Core.dll
  Skipping profile assembly: C:\Program Files (x86)\Reference Assemblies\Microsoft\Framework\MonoTouch\v4.0\System.Net.Http.dll
  Skipping profile assembly: C:\Program Files (x86)\Reference Assemblies\Microsoft\Framework\MonoTouch\v4.0\mscorlib.dll
  Skipping profile assembly: C:\Program Files (x86)\Reference Assemblies\Microsoft\Framework\MonoTouch\v4.0\monotouch.dll
  Skipping profile assembly: C:\Program Files (x86)\Reference Assemblies\Microsoft\Framework\MonoTouch\v4.0\System.dll
  Skipping profile assembly: C:\Program Files (x86)\Reference Assemblies\Microsoft\Framework\MonoTouch\v4.0\System.Runtime.Serialization.dll
  Skipping profile assembly: C:\Program Files (x86)\Reference Assemblies\Microsoft\Framework\MonoTouch\v4.0\System.Core.dll
  Skipping profile assembly: C:\Program Files (x86)\Reference Assemblies\Microsoft\Framework\MonoTouch\v4.0\System.Net.Http.dll
  Skipping profile assembly: C:\Program Files (x86)\Reference Assemblies\Microsoft\Framework\MonoTouch\v4.0\mscorlib.dll
  Skipping profile assembly: C:\Program Files (x86)\Reference Assemblies\Microsoft\Framework\MonoTouch\v4.0\monotouch.dll
  Skipping profile assembly: C:\Program Files (x86)\Reference Assemblies\Microsoft\Framework\MonoTouch\v4.0\System.Core.dll
  Skipping profile assembly: C:\Program Files (x86)\Reference Assemblies\Microsoft\Framework\MonoTouch\v4.0\System.ComponentModel.DataAnnotations.dll
  Skipping profile assembly: C:\Program Files (x86)\Reference Assemblies\Microsoft\Framework\MonoTouch\v4.0\mscorlib.dll
  Skipping profile assembly: C:\Program Files (x86)\Reference Assemblies\Microsoft\Framework\MonoTouch\v4.0\monotouch.dll
  Skipping profile assembly: C:\Program Files (x86)\Reference Assemblies\Microsoft\Framework\MonoTouch\v4.0\System.dll
  Skipping profile assembly: C:\Program Files (x86)\Reference Assemblies\Microsoft\Framework\MonoTouch\v4.0\System.Core.dll
    [Output] ResolvedAssemblies:
      C:\Development\MK Software Solutions\MKS.PMIs\Presentation.iOS\bin\iPhone\Debug\MKS.PreventativeMaintenanceInspections.Presentation.iOS.exe
      C:\Development\MK Software Solutions\MKS.PMIs\Presentation.iOS\bin\iPhone\Debug\MKS.PreventativeMaintenanceInspections.Presentation.iOS.pdb
      C:\Development\MK Software Solutions\MKS.PMIs\Presentation.iOS\bin\iPhone\Debug\MKS.PreventativeMaintenanceInspections.BusinessLogic.iOS.dll
      C:\Development\MK Software Solutions\MKS.PMIs\Presentation.iOS\bin\iPhone\Debug\MKS.PreventativeMaintenanceInspections.BusinessLogic.iOS.pdb
      C:\Development\MK Software Solutions\MKS.PMIs\Presentation.iOS\bin\iPhone\Debug\Newtonsoft.Json.dll
      C:\Development\MK Software Solutions\MKS.PMIs\Presentation.iOS\bin\iPhone\Debug\MKS.VehicleCustomerLookup.iOS.dll
      C:\Development\MK Software Solutions\MKS.PMIs\Presentation.iOS\bin\iPhone\Debug\MKS.Mobile.Core.iOS.dll
      C:\Development\MK Software Solutions\MKS.PMIs\Presentation.iOS\bin\iPhone\Debug\Xamarin.Mobile.dll
      C:\Development\MK Software Solutions\MKS.PMIs\Presentation.iOS\bin\iPhone\Debug\MBProgressHUD.dll
      C:\Development\MK Software Solutions\MKS.PMIs\Presentation.iOS\bin\iPhone\Debug\MBProgressHUD.dll.mdb
_GenerateBundleContentDir:
  Preparing application bundle
  Copying file from "C:\Development\MK Software Solutions\MKS.PMIs\Presentation.iOS\bin\iPhone\Debug\MKS.PreventativeMaintenanceInspections.Presentation.iOS.exe" to "C:\Development\MK Software Solutions\MKS.PMIs\Presentation.iOS\obj\iPhone\Debug\build_package\assemblies\MKS.PreventativeMaintenanceInspections.Presentation.iOS.exe".
  Copying file from "C:\Development\MK Software Solutions\MKS.PMIs\Presentation.iOS\bin\iPhone\Debug\MKS.PreventativeMaintenanceInspections.Presentation.iOS.pdb" to "C:\Development\MK Software Solutions\MKS.PMIs\Presentation.iOS\obj\iPhone\Debug\build_package\assemblies\MKS.PreventativeMaintenanceInspections.Presentation.iOS.pdb".
  Copying file from "C:\Development\MK Software Solutions\MKS.PMIs\Presentation.iOS\bin\iPhone\Debug\MKS.PreventativeMaintenanceInspections.BusinessLogic.iOS.dll" to "C:\Development\MK Software Solutions\MKS.PMIs\Presentation.iOS\obj\iPhone\Debug\build_package\assemblies\MKS.PreventativeMaintenanceInspections.BusinessLogic.iOS.dll".
  Copying file from "C:\Development\MK Software Solutions\MKS.PMIs\Presentation.iOS\bin\iPhone\Debug\MKS.PreventativeMaintenanceInspections.BusinessLogic.iOS.pdb" to "C:\Development\MK Software Solutions\MKS.PMIs\Presentation.iOS\obj\iPhone\Debug\build_package\assemblies\MKS.PreventativeMaintenanceInspections.BusinessLogic.iOS.pdb".
_BuildNativeApplication:
  Saying hello to the remote server at http://10.10.13.61:49215/
  Fetching manifest...
  Updating information about the remote server
  Uploading changes...
  Synchronizing with the remote server
  Building...
  Building application on the remote server
C:\Program Files (x86)\MSBuild\Xamarin\iOS\Xamarin.MonoTouch.Common.targets(148,3): error : Remote build step failed. [C:\Development\MK Software Solutions\MKS.PMIs\Presentation.iOS\Presentation.iOS.csproj]
C:\Program Files (x86)\MSBuild\Xamarin\iOS\Xamarin.MonoTouch.Common.targets(148,3): error :  [C:\Development\MK Software Solutions\MKS.PMIs\Presentation.iOS\Presentation.iOS.csproj]
C:\Program Files (x86)\MSBuild\Xamarin\iOS\Xamarin.MonoTouch.Common.targets(148,3): error : Remote build step failed. [C:\Development\MK Software Solutions\MKS.PMIs\Presentation.iOS\Presentation.iOS.csproj]
Done Building Project "C:\Development\MK Software Solutions\MKS.PMIs\Presentation.iOS\Presentation.iOS.csproj" (_RemoteBuild target(s)) -- FAILED.

Build FAILED.

"C:\Development\MK Software Solutions\MKS.PMIs\Presentation.iOS\Presentation.iOS.csproj" (_RemoteBuild target) (1) ->
(_BuildNativeApplication target) -> 
  C:\Program Files (x86)\MSBuild\Xamarin\iOS\Xamarin.MonoTouch.Common.targets(148,3): error : Remote build step failed. [C:\Development\MK Software Solutions\MKS.PMIs\Presentation.iOS\Presentation.iOS.csproj]
C:\Program Files (x86)\MSBuild\Xamarin\iOS\Xamarin.MonoTouch.Common.targets(148,3): error :  [C:\Development\MK Software Solutions\MKS.PMIs\Presentation.iOS\Presentation.iOS.csproj]
  C:\Program Files (x86)\MSBuild\Xamarin\iOS\Xamarin.MonoTouch.Common.targets(148,3): error : Remote build step failed. [C:\Development\MK Software Solutions\MKS.PMIs\Presentation.iOS\Presentation.iOS.csproj]

    0 Warning(s)
    2 Error(s)

Time Elapsed 00:01:49.41


Microsoft (R) Build Engine version 4.0.30319.32559
[Microsoft .NET Framework, version 4.0.30319.32559]
Copyright (C) Microsoft Corporation. All rights reserved.

Build started 19/07/2013 10:29:29.
Project "C:\Development\MK Software Solutions\MKS.PMIs\Presentation.iOS\Presentation.iOS.csproj" on node 1 (_RemoteBuild target(s)).
_ResolveAssemblies:
  ResolveAssemblies Task
    ReferenceAssembliesDirectory: C:\Program Files (x86)\Reference Assemblies\Microsoft\Framework\MonoTouch\v4.0\
    I18nAssemblies: 
  Skipping profile assembly: C:\Program Files (x86)\Reference Assemblies\Microsoft\Framework\MonoTouch\v4.0\monotouch.dll
  Skipping profile assembly: C:\Program Files (x86)\Reference Assemblies\Microsoft\Framework\MonoTouch\v4.0\System.dll
  Skipping profile assembly: C:\Program Files (x86)\Reference Assemblies\Microsoft\Framework\MonoTouch\v4.0\MonoTouch.Dialog-1.dll
  Skipping profile assembly: C:\Program Files (x86)\Reference Assemblies\Microsoft\Framework\MonoTouch\v4.0\mscorlib.dll
  Skipping profile assembly: C:\Program Files (x86)\Reference Assemblies\Microsoft\Framework\MonoTouch\v4.0\System.dll
  Skipping profile assembly: C:\Program Files (x86)\Reference Assemblies\Microsoft\Framework\MonoTouch\v4.0\mscorlib.dll
  Skipping profile assembly: C:\Program Files (x86)\Reference Assemblies\Microsoft\Framework\MonoTouch\v4.0\mscorlib.dll
  Skipping profile assembly: C:\Program Files (x86)\Reference Assemblies\Microsoft\Framework\MonoTouch\v4.0\System.dll
  Skipping profile assembly: C:\Program Files (x86)\Reference Assemblies\Microsoft\Framework\MonoTouch\v4.0\System.Core.dll
  Skipping profile assembly: C:\Program Files (x86)\Reference Assemblies\Microsoft\Framework\MonoTouch\v4.0\System.Runtime.Serialization.dll
  Skipping profile assembly: C:\Program Files (x86)\Reference Assemblies\Microsoft\Framework\MonoTouch\v4.0\monotouch.dll
  Skipping profile assembly: C:\Program Files (x86)\Reference Assemblies\Microsoft\Framework\MonoTouch\v4.0\mscorlib.dll
  Skipping profile assembly: C:\Program Files (x86)\Reference Assemblies\Microsoft\Framework\MonoTouch\v4.0\System.dll
  Skipping profile assembly: C:\Program Files (x86)\Reference Assemblies\Microsoft\Framework\MonoTouch\v4.0\System.Core.dll
  Skipping profile assembly: C:\Program Files (x86)\Reference Assemblies\Microsoft\Framework\MonoTouch\v4.0\System.Net.Http.dll
  Skipping profile assembly: C:\Program Files (x86)\Reference Assemblies\Microsoft\Framework\MonoTouch\v4.0\mscorlib.dll
  Skipping profile assembly: C:\Program Files (x86)\Reference Assemblies\Microsoft\Framework\MonoTouch\v4.0\monotouch.dll
  Skipping profile assembly: C:\Program Files (x86)\Reference Assemblies\Microsoft\Framework\MonoTouch\v4.0\System.dll
  Skipping profile assembly: C:\Program Files (x86)\Reference Assemblies\Microsoft\Framework\MonoTouch\v4.0\System.Runtime.Serialization.dll
  Skipping profile assembly: C:\Program Files (x86)\Reference Assemblies\Microsoft\Framework\MonoTouch\v4.0\System.Core.dll
  Skipping profile assembly: C:\Program Files (x86)\Reference Assemblies\Microsoft\Framework\MonoTouch\v4.0\System.Net.Http.dll
  Skipping profile assembly: C:\Program Files (x86)\Reference Assemblies\Microsoft\Framework\MonoTouch\v4.0\mscorlib.dll
  Skipping profile assembly: C:\Program Files (x86)\Reference Assemblies\Microsoft\Framework\MonoTouch\v4.0\monotouch.dll
  Skipping profile assembly: C:\Program Files (x86)\Reference Assemblies\Microsoft\Framework\MonoTouch\v4.0\System.Core.dll
  Skipping profile assembly: C:\Program Files (x86)\Reference Assemblies\Microsoft\Framework\MonoTouch\v4.0\System.ComponentModel.DataAnnotations.dll
  Skipping profile assembly: C:\Program Files (x86)\Reference Assemblies\Microsoft\Framework\MonoTouch\v4.0\mscorlib.dll
  Skipping profile assembly: C:\Program Files (x86)\Reference Assemblies\Microsoft\Framework\MonoTouch\v4.0\monotouch.dll
  Skipping profile assembly: C:\Program Files (x86)\Reference Assemblies\Microsoft\Framework\MonoTouch\v4.0\System.dll
  Skipping profile assembly: C:\Program Files (x86)\Reference Assemblies\Microsoft\Framework\MonoTouch\v4.0\System.Core.dll
    [Output] ResolvedAssemblies:
      C:\Development\MK Software Solutions\MKS.PMIs\Presentation.iOS\bin\iPhone\Debug\MKS.PreventativeMaintenanceInspections.Presentation.iOS.exe
      C:\Development\MK Software Solutions\MKS.PMIs\Presentation.iOS\bin\iPhone\Debug\MKS.PreventativeMaintenanceInspections.Presentation.iOS.pdb
      C:\Development\MK Software Solutions\MKS.PMIs\Presentation.iOS\bin\iPhone\Debug\MKS.PreventativeMaintenanceInspections.BusinessLogic.iOS.dll
      C:\Development\MK Software Solutions\MKS.PMIs\Presentation.iOS\bin\iPhone\Debug\MKS.PreventativeMaintenanceInspections.BusinessLogic.iOS.pdb
      C:\Development\MK Software Solutions\MKS.PMIs\Presentation.iOS\bin\iPhone\Debug\Newtonsoft.Json.dll
      C:\Development\MK Software Solutions\MKS.PMIs\Presentation.iOS\bin\iPhone\Debug\MKS.VehicleCustomerLookup.iOS.dll
      C:\Development\MK Software Solutions\MKS.PMIs\Presentation.iOS\bin\iPhone\Debug\MKS.Mobile.Core.iOS.dll
      C:\Development\MK Software Solutions\MKS.PMIs\Presentation.iOS\bin\iPhone\Debug\Xamarin.Mobile.dll
      C:\Development\MK Software Solutions\MKS.PMIs\Presentation.iOS\bin\iPhone\Debug\MBProgressHUD.dll
      C:\Development\MK Software Solutions\MKS.PMIs\Presentation.iOS\bin\iPhone\Debug\MBProgressHUD.dll.mdb
_GenerateBundleContentDir:
  Preparing application bundle
_BuildNativeApplication:
  Saying hello to the remote server at http://10.10.13.61:49215/
  Fetching manifest...
  Updating information about the remote server
  Uploading changes...
  Synchronizing with the remote server
  Building...
  Building application on the remote server
C:\Program Files (x86)\MSBuild\Xamarin\iOS\Xamarin.MonoTouch.Common.targets(148,3): error : Remote build step failed. [C:\Development\MK Software Solutions\MKS.PMIs\Presentation.iOS\Presentation.iOS.csproj]
C:\Program Files (x86)\MSBuild\Xamarin\iOS\Xamarin.MonoTouch.Common.targets(148,3): error :  [C:\Development\MK Software Solutions\MKS.PMIs\Presentation.iOS\Presentation.iOS.csproj]
C:\Program Files (x86)\MSBuild\Xamarin\iOS\Xamarin.MonoTouch.Common.targets(148,3): error : Remote build step failed. [C:\Development\MK Software Solutions\MKS.PMIs\Presentation.iOS\Presentation.iOS.csproj]
Done Building Project "C:\Development\MK Software Solutions\MKS.PMIs\Presentation.iOS\Presentation.iOS.csproj" (_RemoteBuild target(s)) -- FAILED.

Build FAILED.

"C:\Development\MK Software Solutions\MKS.PMIs\Presentation.iOS\Presentation.iOS.csproj" (_RemoteBuild target) (1) ->
(_BuildNativeApplication target) -> 
  C:\Program Files (x86)\MSBuild\Xamarin\iOS\Xamarin.MonoTouch.Common.targets(148,3): error : Remote build step failed. [C:\Development\MK Software Solutions\MKS.PMIs\Presentation.iOS\Presentation.iOS.csproj]
C:\Program Files (x86)\MSBuild\Xamarin\iOS\Xamarin.MonoTouch.Common.targets(148,3): error :  [C:\Development\MK Software Solutions\MKS.PMIs\Presentation.iOS\Presentation.iOS.csproj]
  C:\Program Files (x86)\MSBuild\Xamarin\iOS\Xamarin.MonoTouch.Common.targets(148,3): error : Remote build step failed. [C:\Development\MK Software Solutions\MKS.PMIs\Presentation.iOS\Presentation.iOS.csproj]

    0 Warning(s)
    2 Error(s)

Time Elapsed 00:01:49.89


Microsoft (R) Build Engine version 4.0.30319.32559
[Microsoft .NET Framework, version 4.0.30319.32559]
Copyright (C) Microsoft Corporation. All rights reserved.

Build started 19/07/2013 10:33:33.
Project "C:\Development\MK Software Solutions\MKS.PMIs\Presentation.iOS\Presentation.iOS.csproj" on node 1 (_RemoteBuild target(s)).
_ResolveAssemblies:
  ResolveAssemblies Task
    ReferenceAssembliesDirectory: C:\Program Files (x86)\Reference Assemblies\Microsoft\Framework\MonoTouch\v4.0\
    I18nAssemblies: 
  Skipping profile assembly: C:\Program Files (x86)\Reference Assemblies\Microsoft\Framework\MonoTouch\v4.0\monotouch.dll
  Skipping profile assembly: C:\Program Files (x86)\Reference Assemblies\Microsoft\Framework\MonoTouch\v4.0\System.dll
  Skipping profile assembly: C:\Program Files (x86)\Reference Assemblies\Microsoft\Framework\MonoTouch\v4.0\MonoTouch.Dialog-1.dll
  Skipping profile assembly: C:\Program Files (x86)\Reference Assemblies\Microsoft\Framework\MonoTouch\v4.0\mscorlib.dll
  Skipping profile assembly: C:\Program Files (x86)\Reference Assemblies\Microsoft\Framework\MonoTouch\v4.0\System.dll
  Skipping profile assembly: C:\Program Files (x86)\Reference Assemblies\Microsoft\Framework\MonoTouch\v4.0\mscorlib.dll
  Skipping profile assembly: C:\Program Files (x86)\Reference Assemblies\Microsoft\Framework\MonoTouch\v4.0\mscorlib.dll
  Skipping profile assembly: C:\Program Files (x86)\Reference Assemblies\Microsoft\Framework\MonoTouch\v4.0\System.dll
  Skipping profile assembly: C:\Program Files (x86)\Reference Assemblies\Microsoft\Framework\MonoTouch\v4.0\System.Core.dll
  Skipping profile assembly: C:\Program Files (x86)\Reference Assemblies\Microsoft\Framework\MonoTouch\v4.0\System.Runtime.Serialization.dll
  Skipping profile assembly: C:\Program Files (x86)\Reference Assemblies\Microsoft\Framework\MonoTouch\v4.0\monotouch.dll
  Skipping profile assembly: C:\Program Files (x86)\Reference Assemblies\Microsoft\Framework\MonoTouch\v4.0\mscorlib.dll
  Skipping profile assembly: C:\Program Files (x86)\Reference Assemblies\Microsoft\Framework\MonoTouch\v4.0\System.dll
  Skipping profile assembly: C:\Program Files (x86)\Reference Assemblies\Microsoft\Framework\MonoTouch\v4.0\System.Core.dll
  Skipping profile assembly: C:\Program Files (x86)\Reference Assemblies\Microsoft\Framework\MonoTouch\v4.0\System.Net.Http.dll
  Skipping profile assembly: C:\Program Files (x86)\Reference Assemblies\Microsoft\Framework\MonoTouch\v4.0\mscorlib.dll
  Skipping profile assembly: C:\Program Files (x86)\Reference Assemblies\Microsoft\Framework\MonoTouch\v4.0\monotouch.dll
  Skipping profile assembly: C:\Program Files (x86)\Reference Assemblies\Microsoft\Framework\MonoTouch\v4.0\System.dll
  Skipping profile assembly: C:\Program Files (x86)\Reference Assemblies\Microsoft\Framework\MonoTouch\v4.0\System.Runtime.Serialization.dll
  Skipping profile assembly: C:\Program Files (x86)\Reference Assemblies\Microsoft\Framework\MonoTouch\v4.0\System.Core.dll
  Skipping profile assembly: C:\Program Files (x86)\Reference Assemblies\Microsoft\Framework\MonoTouch\v4.0\System.Net.Http.dll
  Skipping profile assembly: C:\Program Files (x86)\Reference Assemblies\Microsoft\Framework\MonoTouch\v4.0\mscorlib.dll
  Skipping profile assembly: C:\Program Files (x86)\Reference Assemblies\Microsoft\Framework\MonoTouch\v4.0\monotouch.dll
  Skipping profile assembly: C:\Program Files (x86)\Reference Assemblies\Microsoft\Framework\MonoTouch\v4.0\System.Core.dll
  Skipping profile assembly: C:\Program Files (x86)\Reference Assemblies\Microsoft\Framework\MonoTouch\v4.0\System.ComponentModel.DataAnnotations.dll
  Skipping profile assembly: C:\Program Files (x86)\Reference Assemblies\Microsoft\Framework\MonoTouch\v4.0\mscorlib.dll
  Skipping profile assembly: C:\Program Files (x86)\Reference Assemblies\Microsoft\Framework\MonoTouch\v4.0\monotouch.dll
  Skipping profile assembly: C:\Program Files (x86)\Reference Assemblies\Microsoft\Framework\MonoTouch\v4.0\System.dll
  Skipping profile assembly: C:\Program Files (x86)\Reference Assemblies\Microsoft\Framework\MonoTouch\v4.0\System.Core.dll
    [Output] ResolvedAssemblies:
      C:\Development\MK Software Solutions\MKS.PMIs\Presentation.iOS\bin\iPhone\Debug\MKS.PreventativeMaintenanceInspections.Presentation.iOS.exe
      C:\Development\MK Software Solutions\MKS.PMIs\Presentation.iOS\bin\iPhone\Debug\MKS.PreventativeMaintenanceInspections.Presentation.iOS.pdb
      C:\Development\MK Software Solutions\MKS.PMIs\Presentation.iOS\bin\iPhone\Debug\MKS.PreventativeMaintenanceInspections.BusinessLogic.iOS.dll
      C:\Development\MK Software Solutions\MKS.PMIs\Presentation.iOS\bin\iPhone\Debug\MKS.PreventativeMaintenanceInspections.BusinessLogic.iOS.pdb
      C:\Development\MK Software Solutions\MKS.PMIs\Presentation.iOS\bin\iPhone\Debug\Newtonsoft.Json.dll
      C:\Development\MK Software Solutions\MKS.PMIs\Presentation.iOS\bin\iPhone\Debug\MKS.VehicleCustomerLookup.iOS.dll
      C:\Development\MK Software Solutions\MKS.PMIs\Presentation.iOS\bin\iPhone\Debug\MKS.Mobile.Core.iOS.dll
      C:\Development\MK Software Solutions\MKS.PMIs\Presentation.iOS\bin\iPhone\Debug\Xamarin.Mobile.dll
      C:\Development\MK Software Solutions\MKS.PMIs\Presentation.iOS\bin\iPhone\Debug\MBProgressHUD.dll
      C:\Development\MK Software Solutions\MKS.PMIs\Presentation.iOS\bin\iPhone\Debug\MBProgressHUD.dll.mdb
_GenerateBundleContentDir:
  Preparing application bundle
_BuildNativeApplication:
  Saying hello to the remote server at http://10.10.13.61:49215/
  Fetching manifest...
  Updating information about the remote server
  Uploading changes...
  Synchronizing with the remote server
  Building...
  Building application on the remote server
C:\Program Files (x86)\MSBuild\Xamarin\iOS\Xamarin.MonoTouch.Common.targets(148,3): error : Remote build step failed. [C:\Development\MK Software Solutions\MKS.PMIs\Presentation.iOS\Presentation.iOS.csproj]
C:\Program Files (x86)\MSBuild\Xamarin\iOS\Xamarin.MonoTouch.Common.targets(148,3): error :  [C:\Development\MK Software Solutions\MKS.PMIs\Presentation.iOS\Presentation.iOS.csproj]
C:\Program Files (x86)\MSBuild\Xamarin\iOS\Xamarin.MonoTouch.Common.targets(148,3): error : Remote build step failed. [C:\Development\MK Software Solutions\MKS.PMIs\Presentation.iOS\Presentation.iOS.csproj]
Done Building Project "C:\Development\MK Software Solutions\MKS.PMIs\Presentation.iOS\Presentation.iOS.csproj" (_RemoteBuild target(s)) -- FAILED.

Build FAILED.

"C:\Development\MK Software Solutions\MKS.PMIs\Presentation.iOS\Presentation.iOS.csproj" (_RemoteBuild target) (1) ->
(_BuildNativeApplication target) -> 
  C:\Program Files (x86)\MSBuild\Xamarin\iOS\Xamarin.MonoTouch.Common.targets(148,3): error : Remote build step failed. [C:\Development\MK Software Solutions\MKS.PMIs\Presentation.iOS\Presentation.iOS.csproj]
C:\Program Files (x86)\MSBuild\Xamarin\iOS\Xamarin.MonoTouch.Common.targets(148,3): error :  [C:\Development\MK Software Solutions\MKS.PMIs\Presentation.iOS\Presentation.iOS.csproj]
  C:\Program Files (x86)\MSBuild\Xamarin\iOS\Xamarin.MonoTouch.Common.targets(148,3): error : Remote build step failed. [C:\Development\MK Software Solutions\MKS.PMIs\Presentation.iOS\Presentation.iOS.csproj]

    0 Warning(s)
    2 Error(s)

Time Elapsed 00:01:49.82

[2013-07-19 10:29:30.1] Handling with command: [Info: CommmandUrl=Info] (16)
[2013-07-19 10:29:30.1] Attempting to acquire command execution lock, timeout set to 00:10:00
[2013-07-19 10:29:30.1] Starting /Developer/MonoTouch/usr/bin/mtouch -sdkroot "/Applications/Xcode.app/Contents/Developer" --listdev
[2013-07-19 10:29:31.1] stdout: Michael's iPod touch: 80917af45ab7e9cdfffe5b72e311c83560e42c52
[2013-07-19 10:29:31.1] 
[2013-07-19 10:29:31.1] Starting /Developer/MonoTouch/usr/bin/mtouch --version
[2013-07-19 10:29:31.6] stdout: mtouch 6.3.8.11 (bc5a95b)
[2013-07-19 10:29:31.7] 
[2013-07-19 10:29:31.7] Starting /Developer/MonoTouch/usr/bin/mtouch -sdkroot "/Applications/Xcode.app/Contents/Developer" --entitlements
[2013-07-19 10:29:32.6] stdout: 0b94b80a2173854515136228fd9b9f73248d38fd MonoTouch Business 2013-10-04T03:39:27
[2013-07-19 10:29:32.6] 
[2013-07-19 10:29:32.6] Command [Info: CommmandUrl=Info] finished (16)
[2013-07-19 10:29:32.7] Starting /Developer/MonoTouch/usr/bin/mtouch -sdkroot "/Applications/Xcode.app/Contents/Developer" --entitlements
[2013-07-19 10:29:33.7] stdout: 0b94b80a2173854515136228fd9b9f73248d38fd MonoTouch Business 2013-10-04T03:39:27
[2013-07-19 10:29:33.7] 
[2013-07-19 10:29:33.7] Handling with command: [FileManifest: CommmandUrl=FileManifest] (16)
[2013-07-19 10:29:33.7] Attempting to acquire command execution lock, timeout set to 00:10:00
[2013-07-19 10:29:33.8] Command [FileManifest: CommmandUrl=FileManifest] finished (16)
[2013-07-19 10:29:37.6] Starting /Developer/MonoTouch/usr/bin/mtouch -sdkroot "/Applications/Xcode.app/Contents/Developer" --entitlements
[2013-07-19 10:29:38.6] stdout: 0b94b80a2173854515136228fd9b9f73248d38fd MonoTouch Business 2013-10-04T03:39:27
[2013-07-19 10:29:38.7] 
[2013-07-19 10:29:38.7] Handling with command: [UploadChanges: CommmandUrl=UploadChanges] (18)
[2013-07-19 10:29:38.7] Attempting to acquire command execution lock, timeout set to 00:10:00
[2013-07-19 10:29:39.1] Command [UploadChanges: CommmandUrl=UploadChanges] finished (18)
[2013-07-19 10:29:39.2] Starting /Developer/MonoTouch/usr/bin/mtouch -sdkroot "/Applications/Xcode.app/Contents/Developer" --entitlements
[2013-07-19 10:29:40.1] stdout: 0b94b80a2173854515136228fd9b9f73248d38fd MonoTouch Business 2013-10-04T03:39:27
[2013-07-19 10:29:40.2] 
[2013-07-19 10:29:40.2] Handling with command: [Build: CommmandUrl=Build] (18)
[2013-07-19 10:29:40.2] Attempting to acquire command execution lock, timeout set to 00:10:00
[2013-07-19 10:33:34.4] Handling with command: [Info: CommmandUrl=Info] (19)
[2013-07-19 10:33:34.4] Attempting to acquire command execution lock, timeout set to 00:10:00
[2013-07-19 10:33:34.4] Starting /Developer/MonoTouch/usr/bin/mtouch -sdkroot "/Applications/Xcode.app/Contents/Developer" --listdev
[2013-07-19 10:33:35.3] stdout: Michael's iPod touch: 80917af45ab7e9cdfffe5b72e311c83560e42c52
[2013-07-19 10:33:35.4] 
[2013-07-19 10:33:35.4] Starting /Developer/MonoTouch/usr/bin/mtouch --version
[2013-07-19 10:33:35.9] stdout: mtouch 6.3.8.11 (bc5a95b)
[2013-07-19 10:33:36.0] 
[2013-07-19 10:33:36.0] Starting /Developer/MonoTouch/usr/bin/mtouch -sdkroot "/Applications/Xcode.app/Contents/Developer" --entitlements
[2013-07-19 10:33:36.9] stdout: 0b94b80a2173854515136228fd9b9f73248d38fd MonoTouch Business 2013-10-04T03:39:27
[2013-07-19 10:33:37.0] 
[2013-07-19 10:33:37.0] Command [Info: CommmandUrl=Info] finished (19)
[2013-07-19 10:33:37.1] Starting /Developer/MonoTouch/usr/bin/mtouch -sdkroot "/Applications/Xcode.app/Contents/Developer" --entitlements
[2013-07-19 10:33:38.0] stdout: 0b94b80a2173854515136228fd9b9f73248d38fd MonoTouch Business 2013-10-04T03:39:27
[2013-07-19 10:33:38.1] 
[2013-07-19 10:33:38.1] Handling with command: [FileManifest: CommmandUrl=FileManifest] (19)
[2013-07-19 10:33:38.1] Attempting to acquire command execution lock, timeout set to 00:10:00
[2013-07-19 10:33:38.1] Command [FileManifest: CommmandUrl=FileManifest] finished (19)
[2013-07-19 10:33:41.8] Starting /Developer/MonoTouch/usr/bin/mtouch -sdkroot "/Applications/Xcode.app/Contents/Developer" --entitlements
[2013-07-19 10:33:42.8] stdout: 0b94b80a2173854515136228fd9b9f73248d38fd MonoTouch Business 2013-10-04T03:39:27
[2013-07-19 10:33:42.8] 
[2013-07-19 10:33:42.8] Handling with command: [UploadChanges: CommmandUrl=UploadChanges] (19)
[2013-07-19 10:33:42.8] Attempting to acquire command execution lock, timeout set to 00:10:00
[2013-07-19 10:33:43.2] Command [UploadChanges: CommmandUrl=UploadChanges] finished (19)
[2013-07-19 10:33:43.6] Starting /Developer/MonoTouch/usr/bin/mtouch -sdkroot "/Applications/Xcode.app/Contents/Developer" --entitlements
[2013-07-19 10:33:44.6] stdout: 0b94b80a2173854515136228fd9b9f73248d38fd MonoTouch Business 2013-10-04T03:39:27
[2013-07-19 10:33:44.7] 
[2013-07-19 10:33:44.7] Handling with command: [Build: CommmandUrl=Build] (20)
[2013-07-19 10:33:44.7] Attempting to acquire command execution lock, timeout set to 00:10:00
Comment 12 Jose Miguel Torres 2013-07-25 04:38:48 UTC
Ok, I am still trying to find out what's wrong. I will keep you up-to-date.
Comment 13 Olivier Abrivard 2013-08-22 13:23:06 UTC
Hi,

I've juste upgraded to the last version of Monotouch (6.4.3.0) and I experience the same problem.
Everything run fine when I build the solution and target the iOS simultator with Visual Studio 2012.
But the build fails when I build the soluton in debug mode and target the physical device.
No problem with either target when I use MonoDevelop on the Mac host and rebuild everything before starting debug.

I have tried various tricks such as clearing the build cache on the Mac host and removing all Visual Studio bin and obj files. But it didn't help.

Please fin the mac host build logs below this message (I run Visual Studio 2012 on a Windows 8 Parallels VM on the mac host).

Let me know if you need more information.

Best regards,
Olivier Abrivard


[2013-08-22 18:51:15.0] Handling with command: [Info: CommmandUrl=Info] (11)
[2013-08-22 18:51:15.0] Attempting to acquire command execution lock, timeout set to 00:10:00
[2013-08-22 18:51:15.0] Starting /Developer/MonoTouch/usr/bin/mtouch -sdkroot "/Applications/Xcode.app/Contents/Developer" --listdev
[2013-08-22 18:51:15.8] stdout: iPad de EvilOli: 86baaa4c207800f51fa2191f16bce5cd99d3ac62
[2013-08-22 18:51:15.9] 
[2013-08-22 18:51:15.9] Starting /Developer/MonoTouch/usr/bin/mtouch --version
[2013-08-22 18:51:16.2] stdout: mtouch 6.4.3.0 (0068990)
[2013-08-22 18:51:16.3] 
[2013-08-22 18:51:16.3] Starting /Developer/MonoTouch/usr/bin/mtouch -sdkroot "/Applications/Xcode.app/Contents/Developer" --entitlements
[2013-08-22 18:51:17.0] stdout: e38b8cf8e3fffbe0ab0904a62045e6a0b5f8220b MonoTouch Business 2014-02-22T13:55:16
[2013-08-22 18:51:17.0] 
[2013-08-22 18:51:17.0] Command [Info: CommmandUrl=Info] finished (11)
[2013-08-22 18:51:17.0] Starting /Developer/MonoTouch/usr/bin/mtouch -sdkroot "/Applications/Xcode.app/Contents/Developer" --entitlements
[2013-08-22 18:51:17.7] stdout: e38b8cf8e3fffbe0ab0904a62045e6a0b5f8220b MonoTouch Business 2014-02-22T13:55:16
[2013-08-22 18:51:17.8] 
[2013-08-22 18:51:17.8] Handling with command: [FileManifest: CommmandUrl=FileManifest] (11)
[2013-08-22 18:51:17.8] Attempting to acquire command execution lock, timeout set to 00:10:00
[2013-08-22 18:51:17.8] Command [FileManifest: CommmandUrl=FileManifest] finished (11)
[2013-08-22 18:51:19.8] Starting /Developer/MonoTouch/usr/bin/mtouch -sdkroot "/Applications/Xcode.app/Contents/Developer" --entitlements
[2013-08-22 18:51:20.5] stdout: e38b8cf8e3fffbe0ab0904a62045e6a0b5f8220b MonoTouch Business 2014-02-22T13:55:16
[2013-08-22 18:51:20.5] 
[2013-08-22 18:51:20.5] Handling with command: [UploadChanges: CommmandUrl=UploadChanges] (12)
[2013-08-22 18:51:20.5] Attempting to acquire command execution lock, timeout set to 00:10:00
[2013-08-22 18:51:20.7] Command [UploadChanges: CommmandUrl=UploadChanges] finished (12)
[2013-08-22 18:51:20.7] Starting /Developer/MonoTouch/usr/bin/mtouch -sdkroot "/Applications/Xcode.app/Contents/Developer" --entitlements
[2013-08-22 18:51:21.4] stdout: e38b8cf8e3fffbe0ab0904a62045e6a0b5f8220b MonoTouch Business 2014-02-22T13:55:16
[2013-08-22 18:51:21.5] 
[2013-08-22 18:51:21.5] Handling with command: [Build: CommmandUrl=Build] (12)
[2013-08-22 18:51:21.5] Attempting to acquire command execution lock, timeout set to 00:10:00
[2013-08-22 18:51:21.5] 	Running tool: DebugInformationConverter
[2013-08-22 18:51:21.5] Starting pdb2mdb "ICSharpCode.SharpZipLib.dll"
[2013-08-22 18:51:21.6] Starting pdb2mdb "MySyfadis.AppLogic.MT.dll"
[2013-08-22 18:51:21.7] Starting pdb2mdb "MySyfadis.Domain.dll"
[2013-08-22 18:51:21.8] Starting pdb2mdb "MySyfadis.Framework.Impl.MT.dll"
[2013-08-22 18:51:22.0] Starting pdb2mdb "MySyfadis.Framework.MT.dll"
[2013-08-22 18:51:22.0] Starting pdb2mdb "MySyfadisTestMT.exe"
[2013-08-22 18:51:22.2] Starting pdb2mdb "Newtonsoft.Json.dll"
[2013-08-22 18:51:22.3] Starting pdb2mdb "log4net.dll"
[2013-08-22 18:51:22.4] 	Running tool: PreBuildFixups
[2013-08-22 18:51:22.4] 	Running tool: ContentCopier
[2013-08-22 18:51:22.4] Copying '/Users/oabrivard/Library/Caches/Xamarin/mtbs/builds/MySyfadisTestMT/5a87a686-9e4c-4f57-8294-db2b991b7bfc/bundle/MySyfadisTestMT.app/Assets/gizmo.mp4' to '/Users/oabrivard/Library/Caches/Xamarin/mtbs/builds/MySyfadisTestMT/5a87a686-9e4c-4f57-8294-db2b991b7bfc/output/Debug/iPhone/MySyfadisTestMT.app/Assets/gizmo.mp4'
[2013-08-22 18:51:22.4] Copying '/Users/oabrivard/Library/Caches/Xamarin/mtbs/builds/MySyfadisTestMT/5a87a686-9e4c-4f57-8294-db2b991b7bfc/bundle/MySyfadisTestMT.app/Assets/logo-futur_skill.jpg' to '/Users/oabrivard/Library/Caches/Xamarin/mtbs/builds/MySyfadisTestMT/5a87a686-9e4c-4f57-8294-db2b991b7bfc/output/Debug/iPhone/MySyfadisTestMT.app/Assets/logo-futur_skill.jpg'
[2013-08-22 18:51:22.4] Copying '/Users/oabrivard/Library/Caches/Xamarin/mtbs/builds/MySyfadisTestMT/5a87a686-9e4c-4f57-8294-db2b991b7bfc/bundle/MySyfadisTestMT.app/Assets/MySyfadisAsset.txt' to '/Users/oabrivard/Library/Caches/Xamarin/mtbs/builds/MySyfadisTestMT/5a87a686-9e4c-4f57-8294-db2b991b7bfc/output/Debug/iPhone/MySyfadisTestMT.app/Assets/MySyfadisAsset.txt'
[2013-08-22 18:51:22.4] Copying '/Users/oabrivard/Library/Caches/Xamarin/mtbs/builds/MySyfadisTestMT/5a87a686-9e4c-4f57-8294-db2b991b7bfc/bundle/MySyfadisTestMT.app/Assets/log4net.config' to '/Users/oabrivard/Library/Caches/Xamarin/mtbs/builds/MySyfadisTestMT/5a87a686-9e4c-4f57-8294-db2b991b7bfc/output/Debug/iPhone/MySyfadisTestMT.app/Assets/log4net.config'
[2013-08-22 18:51:22.4] Copying '/Users/oabrivard/Library/Caches/Xamarin/mtbs/builds/MySyfadisTestMT/5a87a686-9e4c-4f57-8294-db2b991b7bfc/bundle/MySyfadisTestMT.app/Assets/MySyfadisArchive.zip' to '/Users/oabrivard/Library/Caches/Xamarin/mtbs/builds/MySyfadisTestMT/5a87a686-9e4c-4f57-8294-db2b991b7bfc/output/Debug/iPhone/MySyfadisTestMT.app/Assets/MySyfadisArchive.zip'
[2013-08-22 18:51:22.5] Copying '/Users/oabrivard/Library/Caches/Xamarin/mtbs/builds/MySyfadisTestMT/5a87a686-9e4c-4f57-8294-db2b991b7bfc/bundle/MySyfadisTestMT.app/Assets/InvalidMySyfadisArchive.zip' to '/Users/oabrivard/Library/Caches/Xamarin/mtbs/builds/MySyfadisTestMT/5a87a686-9e4c-4f57-8294-db2b991b7bfc/output/Debug/iPhone/MySyfadisTestMT.app/Assets/InvalidMySyfadisArchive.zip'
[2013-08-22 18:51:22.5] Copying '/Users/oabrivard/Library/Caches/Xamarin/mtbs/builds/MySyfadisTestMT/5a87a686-9e4c-4f57-8294-db2b991b7bfc/bundle/MySyfadisTestMT.app/Assets/application.json' to '/Users/oabrivard/Library/Caches/Xamarin/mtbs/builds/MySyfadisTestMT/5a87a686-9e4c-4f57-8294-db2b991b7bfc/output/Debug/iPhone/MySyfadisTestMT.app/Assets/application.json'
[2013-08-22 18:51:22.5] 	Running tool: TrialCheckChanges
[2013-08-22 18:51:22.5] Starting /Developer/MonoTouch/usr/bin/mtouch -sdkroot "/Applications/Xcode.app/Contents/Developer" --entitlements
[2013-08-22 18:51:23.1] stdout: e38b8cf8e3fffbe0ab0904a62045e6a0b5f8220b MonoTouch Business 2014-02-22T13:55:16
[2013-08-22 18:51:23.1] 
[2013-08-22 18:51:23.1] 	Running tool: Mtouch
[2013-08-22 18:51:23.1] Starting /Developer/MonoTouch/usr/bin/mtouch -v -sdkroot "/Applications/Xcode.app/Contents/Developer" --cache "/Users/oabrivard/Library/Caches/Xamarin/mtbs/builds/MySyfadisTestMT/5a87a686-9e4c-4f57-8294-db2b991b7bfc/output/temp/mtouch-cache" --nomanifest --nosign -dev "/Users/oabrivard/Library/Caches/Xamarin/mtbs/builds/MySyfadisTestMT/5a87a686-9e4c-4f57-8294-db2b991b7bfc/output/Debug/iPhone/MySyfadisTestMT.app" -r "/Users/oabrivard/Library/Caches/Xamarin/mtbs/builds/MySyfadisTestMT/5a87a686-9e4c-4f57-8294-db2b991b7bfc/assemblies/ICSharpCode.SharpZipLib.dll" -r "/Users/oabrivard/Library/Caches/Xamarin/mtbs/builds/MySyfadisTestMT/5a87a686-9e4c-4f57-8294-db2b991b7bfc/assemblies/MySyfadis.AppLogic.MT.dll" -r "/Users/oabrivard/Library/Caches/Xamarin/mtbs/builds/MySyfadisTestMT/5a87a686-9e4c-4f57-8294-db2b991b7bfc/assemblies/MySyfadis.Domain.dll" -r "/Users/oabrivard/Library/Caches/Xamarin/mtbs/builds/MySyfadisTestMT/5a87a686-9e4c-4f57-8294-db2b991b7bfc/assemblies/MySyfadis.Framework.Impl.MT.dll" -r "/Users/oabrivard/Library/Caches/Xamarin/mtbs/builds/MySyfadisTestMT/5a87a686-9e4c-4f57-8294-db2b991b7bfc/assemblies/MySyfadis.Framework.MT.dll" -r "/Users/oabrivard/Library/Caches/Xamarin/mtbs/builds/MySyfadisTestMT/5a87a686-9e4c-4f57-8294-db2b991b7bfc/assemblies/Newtonsoft.Json.dll" -r "/Users/oabrivard/Library/Caches/Xamarin/mtbs/builds/MySyfadisTestMT/5a87a686-9e4c-4f57-8294-db2b991b7bfc/assemblies/log4net.dll" -debug -linksdkonly -sdk "6.1" -targetver "3.2" --abi=armv7 "-v" "-v" "-v" "/Users/oabrivard/Library/Caches/Xamarin/mtbs/builds/MySyfadisTestMT/5a87a686-9e4c-4f57-8294-db2b991b7bfc/assemblies/MySyfadisTestMT.exe"
[2013-08-22 18:51:25.9] stderr: error MT2001: Could not link assemblies. Reason: Argument is out of range.
[2013-08-22 18:51:25.9] --- inner exception
[2013-08-22 18:51:25.9] System.ArgumentOutOfRangeException: Argument is out of range.
[2013-08-22 18:51:25.9]   at Mono.Collections.Generic.Collection`1[Mono.Cecil.Cil.VariableDefinition].get_Item (Int32 index) [0x00000] in <filename unknown>:0 
[2013-08-22 18:51:25.9]   at Mono.Cecil.Mdb.MdbReader.ReadLocalVariables (Mono.CompilerServices.SymbolWriter.MethodEntry entry, Mono.Cecil.Cil.MethodBody body, Mono.Cecil.Cil.Scope[] scopes) [0x00000] in <filename unknown>:0 
[2013-08-22 18:51:25.9]   at Mono.Cecil.Mdb.MdbReader.Read (Mono.Cecil.Cil.MethodBody body, Mono.Cecil.Cil.InstructionMapper mapper) [0x00000] in <filename unknown>:0 
[2013-08-22 18:51:25.9]   at Mono.Cecil.Cil.CodeReader.ReadMethodBody () [0x00000] in <filename unknown>:0 
[2013-08-22 18:51:25.9]   at Mono.Cecil.Cil.CodeReader.ReadMethodBody (Mono.Cecil.MethodDefinition method) [0x00000] in <filename unknown>:0 
[2013-08-22 18:51:25.9]   at Mono.Cecil.MetadataReader.ReadMethodBody (Mono.Cecil.MethodDefinition method) [0x00000] in <filename unknown>:0 
[2013-08-22 18:51:25.9]   at Mono.Cecil.MethodDefinition.<get_Body>m__34 (Mono.Cecil.MethodDefinition method, Mono.Cecil.MetadataReader reader) [0x00000] in <filename unknown>:0 
[2013-08-22 18:51:25.9]   at Mono.Cecil.ModuleDefinition.Read[MethodDefinition,MethodBody] (Mono.Cecil.MethodDefinition item, System.Func`3 read) [0x00000] in <filename unknown>:0 
[2013-08-22 18:51:25.9]   at Mono.Cecil.MethodDefinition.get_Body () [0x00000] in <filename unknown>:0 
[2013-08-22 18:51:25.9]   at Mono.Linker.Steps.MarkStep.ProcessMethod (Mono.Cecil.MethodDefinition method) [0x00000] in <filename unknown>:0 
[2013-08-22 18:51:25.9]   at MonoTouch.Tuner.MonoTouchMarkStep.ProcessMethod (Mono.Cecil.MethodDefinition method) [0x00000] in <filename unknown>:0 
[2013-08-22 18:51:25.9]   at Mono.Linker.Steps.MarkStep.ProcessQueue () [0x00000] in <filename unknown>:0 
[2013-08-22 18:51:25.9]   at Mono.Linker.Steps.MarkStep.Process () [0x00000] in <filename unknown>:0 
[2013-08-22 18:51:25.9]   at Mono.Linker.Steps.MarkStep.Process (Mono.Linker.LinkContext context) [0x00000] in <filename unknown>:0 
[2013-08-22 18:51:25.9]   at MonoTouch.Tuner.MonoTouchMarkStep.Process (Mono.Linker.LinkContext context) [0x00000] in <filename unknown>:0 
[2013-08-22 18:51:25.9]   at Mono.Linker.Pipeline.Process (Mono.Linker.LinkContext context) [0x00000] in <filename unknown>:0 
[2013-08-22 18:51:25.9]   at MonoTouch.Tuner.Linker.Process (MonoTouch.Tuner.LinkerOptions options, Mono.Linker.LinkContext& context, System.Collections.Generic.List`1& assemblies) [0x00000] in <filename unknown>:0 
[2013-08-22 18:51:25.9] ---
[2013-08-22 18:51:25.9]   at MonoTouch.Tuner.Linker.Process (MonoTouch.Tuner.LinkerOptions options, Mono.Linker.LinkContext& context, System.Collections.Generic.List`1& assemblies) [0x00000] in <filename unknown>:0 
[2013-08-22 18:51:25.9]   at MTouch.LinkAssemblies (System.String main, System.Collections.Generic.List`1& assemblies, System.String output_dir, Mono.Linker.LinkContext& link_context) [0x00000] in <filename unknown>:0 
[2013-08-22 18:51:25.9]   at MonoTouch.Application.ManagedLink () [0x00000] in <filename unknown>:0 
[2013-08-22 18:51:25.9]   at MonoTouch.Application.ProcessAssemblies () [0x00000] in <filename unknown>:0 
[2013-08-22 18:51:25.9]   at MonoTouch.Application.BuildApp () [0x00000] in <filename unknown>:0 
[2013-08-22 18:51:25.9]   at MonoTouch.Application.Build () [0x00000] in <filename unknown>:0 
[2013-08-22 18:51:25.9]   at MTouch.Main2 (System.String[] args) [0x00000] in <filename unknown>:0 
[2013-08-22 18:51:25.9]   at MTouch.Main (System.String[] args) [0x00000] in <filename unknown>:0 
[2013-08-22 18:51:25.9] 
[2013-08-22 18:51:25.9] stdout: MonoTouch Business version 6.4.3.0 (0068990) using framework: /Applications/Xcode.app/Contents/Developer/Platforms/iPhoneOS.platform/Developer/SDKs/iPhoneOS6.1.sdk
[2013-08-22 18:51:25.9] A full rebuild will be performed because the cache is either incomplete or entirely missing.
[2013-08-22 18:51:25.9] Copied /Users/oabrivard/Library/Caches/Xamarin/mtbs/builds/MySyfadisTestMT/5a87a686-9e4c-4f57-8294-db2b991b7bfc/assemblies/MySyfadisTestMT.exe to /Users/oabrivard/Library/Caches/Xamarin/mtbs/builds/MySyfadisTestMT/5a87a686-9e4c-4f57-8294-db2b991b7bfc/output/temp/mtouch-cache/Link/MySyfadisTestMT.exe
[2013-08-22 18:51:25.9] Copied /Users/oabrivard/Library/Caches/Xamarin/mtbs/builds/MySyfadisTestMT/5a87a686-9e4c-4f57-8294-db2b991b7bfc/assemblies/MySyfadisTestMT.exe.mdb to /Users/oabrivard/Library/Caches/Xamarin/mtbs/builds/MySyfadisTestMT/5a87a686-9e4c-4f57-8294-db2b991b7bfc/output/temp/mtouch-cache/Link/MySyfadisTestMT.exe.mdb
[2013-08-22 18:51:25.9] Copied /Developer/MonoTouch/usr/lib/mono/2.1/mscorlib-runtime.dll to /Users/oabrivard/Library/Caches/Xamarin/mtbs/builds/MySyfadisTestMT/5a87a686-9e4c-4f57-8294-db2b991b7bfc/output/temp/mtouch-cache/Link/mscorlib.dll
[2013-08-22 18:51:25.9] Copied /Developer/MonoTouch/usr/lib/mono/2.1/mscorlib-runtime.dll.mdb to /Users/oabrivard/Library/Caches/Xamarin/mtbs/builds/MySyfadisTestMT/5a87a686-9e4c-4f57-8294-db2b991b7bfc/output/temp/mtouch-cache/Link/mscorlib.dll.mdb
[2013-08-22 18:51:25.9] Copied /Users/oabrivard/Library/Caches/Xamarin/mtbs/builds/MySyfadisTestMT/5a87a686-9e4c-4f57-8294-db2b991b7bfc/assemblies/MySyfadis.Framework.MT.dll to /Users/oabrivard/Library/Caches/Xamarin/mtbs/builds/MySyfadisTestMT/5a87a686-9e4c-4f57-8294-db2b991b7bfc/output/temp/mtouch-cache/Link/MySyfadis.Framework.MT.dll
[2013-08-22 18:51:25.9] Copied /Users/oabrivard/Library/Caches/Xamarin/mtbs/builds/MySyfadisTestMT/5a87a686-9e4c-4f57-8294-db2b991b7bfc/assemblies/MySyfadis.Framework.MT.dll.mdb to /Users/oabrivard/Library/Caches/Xamarin/mtbs/builds/MySyfadisTestMT/5a87a686-9e4c-4f57-8294-db2b991b7bfc/output/temp/mtouch-cache/Link/MySyfadis.Framework.MT.dll.mdb
[2013-08-22 18:51:25.9] Copied /Developer/MonoTouch/usr/lib/mono/2.1/System.Core.dll to /Users/oabrivard/Library/Caches/Xamarin/mtbs/builds/MySyfadisTestMT/5a87a686-9e4c-4f57-8294-db2b991b7bfc/output/temp/mtouch-cache/Link/System.Core.dll
[2013-08-22 18:51:25.9] Copied /Developer/MonoTouch/usr/lib/mono/2.1/System.Core.dll.mdb to /Users/oabrivard/Library/Caches/Xamarin/mtbs/builds/MySyfadisTestMT/5a87a686-9e4c-4f57-8294-db2b991b7bfc/output/temp/mtouch-cache/Link/System.Core.dll.mdb
[2013-08-22 18:51:25.9] Copied /Developer/MonoTouch/usr/lib/mono/2.1/System.dll to /Users/oabrivard/Library/Caches/Xamarin/mtbs/builds/MySyfadisTestMT/5a87a686-9e4c-4f57-8294-db2b991b7bfc/output/temp/mtouch-cache/Link/System.dll
[2013-08-22 18:51:25.9] Copied /Developer/MonoTouch/usr/lib/mono/2.1/System.dll.mdb to /Users/oabrivard/Library/Caches/Xamarin/mtbs/builds/MySyfadisTestMT/5a87a686-9e4c-4f57-8294-db2b991b7bfc/output/temp/mtouch-cache/Link/System.dll.mdb
[2013-08-22 18:51:25.9] Copied /Users/oabrivard/Library/Caches/Xamarin/mtbs/builds/MySyfadisTestMT/5a87a686-9e4c-4f57-8294-db2b991b7bfc/assemblies/log4net.dll to /Users/oabrivard/Library/Caches/Xamarin/mtbs/builds/MySyfadisTestMT/5a87a686-9e4c-4f57-8294-db2b991b7bfc/output/temp/mtouch-cache/Link/log4net.dll
[2013-08-22 18:51:25.9] Copied /Users/oabrivard/Library/Caches/Xamarin/mtbs/builds/MySyfadisTestMT/5a87a686-9e4c-4f57-8294-db2b991b7bfc/assemblies/log4net.dll.mdb to /Users/oabrivard/Library/Caches/Xamarin/mtbs/builds/MySyfadisTestMT/5a87a686-9e4c-4f57-8294-db2b991b7bfc/output/temp/mtouch-cache/Link/log4net.dll.mdb
[2013-08-22 18:51:25.9] Copied /Developer/MonoTouch/usr/lib/mono/2.1/System.Data.dll to /Users/oabrivard/Library/Caches/Xamarin/mtbs/builds/MySyfadisTestMT/5a87a686-9e4c-4f57-8294-db2b991b7bfc/output/temp/mtouch-cache/Link/System.Data.dll
[2013-08-22 18:51:25.9] Copied /Developer/MonoTouch/usr/lib/mono/2.1/System.Data.dll.mdb to /Users/oabrivard/Library/Caches/Xamarin/mtbs/builds/MySyfadisTestMT/5a87a686-9e4c-4f57-8294-db2b991b7bfc/output/temp/mtouch-cache/Link/System.Data.dll.mdb
[2013-08-22 18:51:25.9] Copied /Developer/MonoTouch/usr/lib/mono/2.1/Mono.Data.Tds.dll to /Users/oabrivard/Library/Caches/Xamarin/mtbs/builds/MySyfadisTestMT/5a87a686-9e4c-4f57-8294-db2b991b7bfc/output/temp/mtouch-cache/Link/Mono.Data.Tds.dll
[2013-08-22 18:51:25.9] Copied /Developer/MonoTouch/usr/lib/mono/2.1/Mono.Data.Tds.dll.mdb to /Users/oabrivard/Library/Caches/Xamarin/mtbs/builds/MySyfadisTestMT/5a87a686-9e4c-4f57-8294-db2b991b7bfc/output/temp/mtouch-cache/Link/Mono.Data.Tds.dll.mdb
[2013-08-22 18:51:25.9] Copied /Developer/MonoTouch/usr/lib/mono/2.1/Mono.Security.dll to /Users/oabrivard/Library/Caches/Xamarin/mtbs/builds/MySyfadisTestMT/5a87a686-9e4c-4f57-8294-db2b991b7bfc/output/temp/mtouch-cache/Link/Mono.Security.dll
[2013-08-22 18:51:25.9] Copied /Developer/MonoTouch/usr/lib/mono/2.1/Mono.Security.dll.mdb to /Users/oabrivard/Library/Caches/Xamarin/mtbs/builds/MySyfadisTestMT/5a87a686-9e4c-4f57-8294-db2b991b7bfc/output/temp/mtouch-cache/Link/Mono.Security.dll.mdb
[2013-08-22 18:51:25.9] Copied /Developer/MonoTouch/usr/lib/mono/2.1/System.Xml.dll to /Users/oabrivard/Library/Caches/Xamarin/mtbs/builds/MySyfadisTestMT/5a87a686-9e4c-4f57-8294-db2b991b7bfc/output/temp/mtouch-cache/Link/System.Xml.dll
[2013-08-22 18:51:25.9] Copied /Developer/MonoTouch/usr/lib/mono/2.1/System.Xml.dll.mdb to /Users/oabrivard/Library/Caches/Xamarin/mtbs/builds/MySyfadisTestMT/5a87a686-9e4c-4f57-8294-db2b991b7bfc/output/temp/mtouch-cache/Link/System.Xml.dll.mdb
[2013-08-22 18:51:25.9] Copied /Developer/MonoTouch/usr/lib/mono/2.1/System.Transactions.dll to /Users/oabrivard/Library/Caches/Xamarin/mtbs/builds/MySyfadisTestMT/5a87a686-9e4c-4f57-8294-db2b991b7bfc/output/temp/mtouch-cache/Link/System.Transactions.dll
[2013-08-22 18:51:25.9] Copied /Developer/MonoTouch/usr/lib/mono/2.1/System.Transactions.dll.mdb to /Users/oabrivard/Library/Caches/Xamarin/mtbs/builds/MySyfadisTestMT/5a87a686-9e4c-4f57-8294-db2b991b7bfc/output/temp/mtouch-cache/Link/System.Transactions.dll.mdb
[2013-08-22 18:51:25.9] Copied /Developer/MonoTouch/usr/lib/mono/2.1/monotouch.dll to /Users/oabrivard/Library/Caches/Xamarin/mtbs/builds/MySyfadisTestMT/5a87a686-9e4c-4f57-8294-db2b991b7bfc/output/temp/mtouch-cache/Link/monotouch.dll
[2013-08-22 18:51:25.9] Copied /Developer/MonoTouch/usr/lib/mono/2.1/monotouch.dll.mdb to /Users/oabrivard/Library/Caches/Xamarin/mtbs/builds/MySyfadisTestMT/5a87a686-9e4c-4f57-8294-db2b991b7bfc/output/temp/mtouch-cache/Link/monotouch.dll.mdb
[2013-08-22 18:51:25.9] Copied /Users/oabrivard/Library/Caches/Xamarin/mtbs/builds/MySyfadisTestMT/5a87a686-9e4c-4f57-8294-db2b991b7bfc/assemblies/MySyfadis.AppLogic.MT.dll to /Users/oabrivard/Library/Caches/Xamarin/mtbs/builds/MySyfadisTestMT/5a87a686-9e4c-4f57-8294-db2b991b7bfc/output/temp/mtouch-cache/Link/MySyfadis.AppLogic.MT.dll
[2013-08-22 18:51:25.9] Copied /Users/oabrivard/Library/Caches/Xamarin/mtbs/builds/MySyfadisTestMT/5a87a686-9e4c-4f57-8294-db2b991b7bfc/assemblies/MySyfadis.AppLogic.MT.dll.mdb to /Users/oabrivard/Library/Caches/Xamarin/mtbs/builds/MySyfadisTestMT/5a87a686-9e4c-4f57-8294-db2b991b7bfc/output/temp/mtouch-cache/Link/MySyfadis.AppLogic.MT.dll.mdb
[2013-08-22 18:51:25.9] Copied /Users/oabrivard/Library/Caches/Xamarin/mtbs/builds/MySyfadisTestMT/5a87a686-9e4c-4f57-8294-db2b991b7bfc/assemblies/MySyfadis.Domain.dll to /Users/oabrivard/Library/Caches/Xamarin/mtbs/builds/MySyfadisTestMT/5a87a686-9e4c-4f57-8294-db2b991b7bfc/output/temp/mtouch-cache/Link/MySyfadis.Domain.dll
[2013-08-22 18:51:25.9] Copied /Users/oabrivard/Library/Caches/Xamarin/mtbs/builds/MySyfadisTestMT/5a87a686-9e4c-4f57-8294-db2b991b7bfc/assemblies/MySyfadis.Domain.dll.mdb to /Users/oabrivard/Library/Caches/Xamarin/mtbs/builds/MySyfadisTestMT/5a87a686-9e4c-4f57-8294-db2b991b7bfc/output/temp/mtouch-cache/Link/MySyfadis.Domain.dll.mdb
[2013-08-22 18:51:25.9] Copied /Users/oabrivard/Library/Caches/Xamarin/mtbs/builds/MySyfadisTestMT/5a87a686-9e4c-4f57-8294-db2b991b7bfc/assemblies/MySyfadis.Framework.Impl.MT.dll to /Users/oabrivard/Library/Caches/Xamarin/mtbs/builds/MySyfadisTestMT/5a87a686-9e4c-4f57-8294-db2b991b7bfc/output/temp/mtouch-cache/Link/MySyfadis.Framework.Impl.MT.dll
[2013-08-22 18:51:25.9] Copied /Users/oabrivard/Library/Caches/Xamarin/mtbs/builds/MySyfadisTestMT/5a87a686-9e4c-4f57-8294-db2b991b7bfc/assemblies/MySyfadis.Framework.Impl.MT.dll.mdb to /Users/oabrivard/Library/Caches/Xamarin/mtbs/builds/MySyfadisTestMT/5a87a686-9e4c-4f57-8294-db2b991b7bfc/output/temp/mtouch-cache/Link/MySyfadis.Framework.Impl.MT.dll.mdb
[2013-08-22 18:51:25.9] Copied /Users/oabrivard/Library/Caches/Xamarin/mtbs/builds/MySyfadisTestMT/5a87a686-9e4c-4f57-8294-db2b991b7bfc/assemblies/Newtonsoft.Json.dll to /Users/oabrivard/Library/Caches/Xamarin/mtbs/builds/MySyfadisTestMT/5a87a686-9e4c-4f57-8294-db2b991b7bfc/output/temp/mtouch-cache/Link/Newtonsoft.Json.dll
[2013-08-22 18:51:25.9] Copied /Users/oabrivard/Library/Caches/Xamarin/mtbs/builds/MySyfadisTestMT/5a87a686-9e4c-4f57-8294-db2b991b7bfc/assemblies/Newtonsoft.Json.dll.mdb to /Users/oabrivard/Library/Caches/Xamarin/mtbs/builds/MySyfadisTestMT/5a87a686-9e4c-4f57-8294-db2b991b7bfc/output/temp/mtouch-cache/Link/Newtonsoft.Json.dll.mdb
[2013-08-22 18:51:25.9] Copied /Developer/MonoTouch/usr/lib/mono/2.1/System.Runtime.Serialization.dll to /Users/oabrivard/Library/Caches/Xamarin/mtbs/builds/MySyfadisTestMT/5a87a686-9e4c-4f57-8294-db2b991b7bfc/output/temp/mtouch-cache/Link/System.Runtime.Serialization.dll
[2013-08-22 18:51:25.9] Copied /Developer/MonoTouch/usr/lib/mono/2.1/System.Runtime.Serialization.dll.mdb to /Users/oabrivard/Library/Caches/Xamarin/mtbs/builds/MySyfadisTestMT/5a87a686-9e4c-4f57-8294-db2b991b7bfc/output/temp/mtouch-cache/Link/System.Runtime.Serialization.dll.mdb
[2013-08-22 18:51:25.9] Copied /Users/oabrivard/Library/Caches/Xamarin/mtbs/builds/MySyfadisTestMT/5a87a686-9e4c-4f57-8294-db2b991b7bfc/assemblies/ICSharpCode.SharpZipLib.dll to /Users/oabrivard/Library/Caches/Xamarin/mtbs/builds/MySyfadisTestMT/5a87a686-9e4c-4f57-8294-db2b991b7bfc/output/temp/mtouch-cache/Link/ICSharpCode.SharpZipLib.dll
[2013-08-22 18:51:25.9] Copied /Users/oabrivard/Library/Caches/Xamarin/mtbs/builds/MySyfadisTestMT/5a87a686-9e4c-4f57-8294-db2b991b7bfc/assemblies/ICSharpCode.SharpZipLib.dll.mdb to /Users/oabrivard/Library/Caches/Xamarin/mtbs/builds/MySyfadisTestMT/5a87a686-9e4c-4f57-8294-db2b991b7bfc/output/temp/mtouch-cache/Link/ICSharpCode.SharpZipLib.dll.mdb
[2013-08-22 18:51:25.9] Copied /Developer/MonoTouch/usr/lib/mono/2.1/System.Web.Services.dll to /Users/oabrivard/Library/Caches/Xamarin/mtbs/builds/MySyfadisTestMT/5a87a686-9e4c-4f57-8294-db2b991b7bfc/output/temp/mtouch-cache/Link/System.Web.Services.dll
[2013-08-22 18:51:25.9] Copied /Developer/MonoTouch/usr/lib/mono/2.1/System.Web.Services.dll.mdb to /Users/oabrivard/Library/Caches/Xamarin/mtbs/builds/MySyfadisTestMT/5a87a686-9e4c-4f57-8294-db2b991b7bfc/output/temp/mtouch-cache/Link/System.Web.Services.dll.mdb
[2013-08-22 18:51:25.9] Copied /Developer/MonoTouch/usr/lib/mono/2.1/MonoTouch.NUnitLite.dll to /Users/oabrivard/Library/Caches/Xamarin/mtbs/builds/MySyfadisTestMT/5a87a686-9e4c-4f57-8294-db2b991b7bfc/output/temp/mtouch-cache/Link/MonoTouch.NUnitLite.dll
[2013-08-22 18:51:25.9] Copied /Developer/MonoTouch/usr/lib/mono/2.1/MonoTouch.NUnitLite.dll.mdb to /Users/oabrivard/Library/Caches/Xamarin/mtbs/builds/MySyfadisTestMT/5a87a686-9e4c-4f57-8294-db2b991b7bfc/output/temp/mtouch-cache/Link/MonoTouch.NUnitLite.dll.mdb
[2013-08-22 18:51:25.9] Copied /Developer/MonoTouch/usr/lib/mono/2.1/MonoTouch.Dialog-1.dll to /Users/oabrivard/Library/Caches/Xamarin/mtbs/builds/MySyfadisTestMT/5a87a686-9e4c-4f57-8294-db2b991b7bfc/output/temp/mtouch-cache/Link/MonoTouch.Dialog-1.dll
[2013-08-22 18:51:25.9] Copied /Developer/MonoTouch/usr/lib/mono/2.1/MonoTouch.Dialog-1.dll.mdb to /Users/oabrivard/Library/Caches/Xamarin/mtbs/builds/MySyfadisTestMT/5a87a686-9e4c-4f57-8294-db2b991b7bfc/output/temp/mtouch-cache/Link/MonoTouch.Dialog-1.dll.mdb
[2013-08-22 18:51:25.9] Copied /Developer/MonoTouch/usr/lib/mono/2.1/System.Json.dll to /Users/oabrivard/Library/Caches/Xamarin/mtbs/builds/MySyfadisTestMT/5a87a686-9e4c-4f57-8294-db2b991b7bfc/output/temp/mtouch-cache/Link/System.Json.dll
[2013-08-22 18:51:25.9] Copied /Developer/MonoTouch/usr/lib/mono/2.1/System.Json.dll.mdb to /Users/oabrivard/Library/Caches/Xamarin/mtbs/builds/MySyfadisTestMT/5a87a686-9e4c-4f57-8294-db2b991b7bfc/output/temp/mtouch-cache/Link/System.Json.dll.mdb
[2013-08-22 18:51:25.9] Loaded '/Users/oabrivard/Library/Caches/Xamarin/mtbs/builds/MySyfadisTestMT/5a87a686-9e4c-4f57-8294-db2b991b7bfc/output/temp/mtouch-cache/Link/MySyfadisTestMT.exe'
[2013-08-22 18:51:25.9] Loaded '/Users/oabrivard/Library/Caches/Xamarin/mtbs/builds/MySyfadisTestMT/5a87a686-9e4c-4f57-8294-db2b991b7bfc/output/temp/mtouch-cache/Link/mscorlib.dll'
[2013-08-22 18:51:25.9] Loaded '/Users/oabrivard/Library/Caches/Xamarin/mtbs/builds/MySyfadisTestMT/5a87a686-9e4c-4f57-8294-db2b991b7bfc/output/temp/mtouch-cache/Link/MySyfadis.Framework.MT.dll'
[2013-08-22 18:51:25.9] Loaded '/Users/oabrivard/Library/Caches/Xamarin/mtbs/builds/MySyfadisTestMT/5a87a686-9e4c-4f57-8294-db2b991b7bfc/output/temp/mtouch-cache/Link/System.Core.dll'
[2013-08-22 18:51:25.9] Loaded '/Users/oabrivard/Library/Caches/Xamarin/mtbs/builds/MySyfadisTestMT/5a87a686-9e4c-4f57-8294-db2b991b7bfc/output/temp/mtouch-cache/Link/System.dll'
[2013-08-22 18:51:25.9] Loaded '/Users/oabrivard/Library/Caches/Xamarin/mtbs/builds/MySyfadisTestMT/5a87a686-9e4c-4f57-8294-db2b991b7bfc/output/temp/mtouch-cache/Link/log4net.dll'
[2013-08-22 18:51:25.9] Loaded '/Users/oabrivard/Library/Caches/Xamarin/mtbs/builds/MySyfadisTestMT/5a87a686-9e4c-4f57-8294-db2b991b7bfc/output/temp/mtouch-cache/Link/System.Data.dll'
[2013-08-22 18:51:25.9] Loaded '/Users/oabrivard/Library/Caches/Xamarin/mtbs/builds/MySyfadisTestMT/5a87a686-9e4c-4f57-8294-db2b991b7bfc/output/temp/mtouch-cache/Link/Mono.Data.Tds.dll'
[2013-08-22 18:51:25.9] Loaded '/Users/oabrivard/Library/Caches/Xamarin/mtbs/builds/MySyfadisTestMT/5a87a686-9e4c-4f57-8294-db2b991b7bfc/output/temp/mtouch-cache/Link/Mono.Security.dll'
[2013-08-22 18:51:25.9] Loaded '/Users/oabrivard/Library/Caches/Xamarin/mtbs/builds/MySyfadisTestMT/5a87a686-9e4c-4f57-8294-db2b991b7bfc/output/temp/mtouch-cache/Link/System.Xml.dll'
[2013-08-22 18:51:25.9] Loaded '/Users/oabrivard/Library/Caches/Xamarin/mtbs/builds/MySyfadisTestMT/5a87a686-9e4c-4f57-8294-db2b991b7bfc/output/temp/mtouch-cache/Link/System.Transactions.dll'
[2013-08-22 18:51:25.9] Loaded '/Users/oabrivard/Library/Caches/Xamarin/mtbs/builds/MySyfadisTestMT/5a87a686-9e4c-4f57-8294-db2b991b7bfc/output/temp/mtouch-cache/Link/monotouch.dll'
[2013-08-22 18:51:25.9] Loaded '/Users/oabrivard/Library/Caches/Xamarin/mtbs/builds/MySyfadisTestMT/5a87a686-9e4c-4f57-8294-db2b991b7bfc/output/temp/mtouch-cache/Link/MySyfadis.AppLogic.MT.dll'
[2013-08-22 18:51:25.9] Loaded '/Users/oabrivard/Library/Caches/Xamarin/mtbs/builds/MySyfadisTestMT/5a87a686-9e4c-4f57-8294-db2b991b7bfc/output/temp/mtouch-cache/Link/MySyfadis.Domain.dll'
[2013-08-22 18:51:25.9] Loaded '/Users/oabrivard/Library/Caches/Xamarin/mtbs/builds/MySyfadisTestMT/5a87a686-9e4c-4f57-8294-db2b991b7bfc/output/temp/mtouch-cache/Link/MySyfadis.Framework.Impl.MT.dll'
[2013-08-22 18:51:25.9] Loaded '/Users/oabrivard/Library/Caches/Xamarin/mtbs/builds/MySyfadisTestMT/5a87a686-9e4c-4f57-8294-db2b991b7bfc/output/temp/mtouch-cache/Link/Newtonsoft.Json.dll'
[2013-08-22 18:51:25.9] Loaded '/Users/oabrivard/Library/Caches/Xamarin/mtbs/builds/MySyfadisTestMT/5a87a686-9e4c-4f57-8294-db2b991b7bfc/output/temp/mtouch-cache/Link/System.Runtime.Serialization.dll'
[2013-08-22 18:51:25.9] Loaded '/Users/oabrivard/Library/Caches/Xamarin/mtbs/builds/MySyfadisTestMT/5a87a686-9e4c-4f57-8294-db2b991b7bfc/output/temp/mtouch-cache/Link/ICSharpCode.SharpZipLib.dll'
[2013-08-22 18:51:25.9] Loaded '/Users/oabrivard/Library/Caches/Xamarin/mtbs/builds/MySyfadisTestMT/5a87a686-9e4c-4f57-8294-db2b991b7bfc/output/temp/mtouch-cache/Link/System.Web.Services.dll'
[2013-08-22 18:51:25.9] Loaded '/Users/oabrivard/Library/Caches/Xamarin/mtbs/builds/MySyfadisTestMT/5a87a686-9e4c-4f57-8294-db2b991b7bfc/output/temp/mtouch-cache/Link/MonoTouch.NUnitLite.dll'
[2013-08-22 18:51:25.9] Loaded '/Users/oabrivard/Library/Caches/Xamarin/mtbs/builds/MySyfadisTestMT/5a87a686-9e4c-4f57-8294-db2b991b7bfc/output/temp/mtouch-cache/Link/MonoTouch.Dialog-1.dll'
[2013-08-22 18:51:25.9] Loaded '/Users/oabrivard/Library/Caches/Xamarin/mtbs/builds/MySyfadisTestMT/5a87a686-9e4c-4f57-8294-db2b991b7bfc/output/temp/mtouch-cache/Link/System.Json.dll'
[2013-08-22 18:51:25.9] Linking SDK only for assembly /Users/oabrivard/Library/Caches/Xamarin/mtbs/builds/MySyfadisTestMT/5a87a686-9e4c-4f57-8294-db2b991b7bfc/assemblies/MySyfadisTestMT.exe into /Users/oabrivard/Library/Caches/Xamarin/mtbs/builds/MySyfadisTestMT/5a87a686-9e4c-4f57-8294-db2b991b7bfc/output/temp/mtouch-cache/PreBuild
[2013-08-22 18:51:25.9] 
[2013-08-22 18:51:26.0] Error: Tool MonoTouch.Tools.Tools.Mtouch failed to run
[2013-08-22 18:51:26.0] Command [Build: CommmandUrl=Build] finished (12)
Comment 14 calvin.fisher 2013-09-03 15:17:32 UTC
Is there any update on this, or anything else we can to do help diagnose the issue?  I'm still unable to debug our project from Visual Studio.
Comment 15 Doug G 2013-09-12 14:24:21 UTC
I'm receiving this error with the latest beta for Visual Studio plug-in (1.4) and Xamarin.iOS (6.4.5) when trying to build to an iPod. This was working prior to the upgrade. Xamarin Studio on the Mac is reporting a native linking failure. I've attached the logs for both Visual Studio and Xamarin Studio.
Comment 16 Doug G 2013-09-12 14:26:28 UTC
Created attachment 4857 [details]
Visual Studio log of ArgumentOutOfRangeException
Comment 17 Doug G 2013-09-12 14:27:36 UTC
Created attachment 4858 [details]
Xamarin Studio log of native linking failure
Comment 18 Jose Miguel Torres 2013-09-13 05:49:37 UTC
Hi Doug,

Could you check if you have the sdk at %PROGRAM_FILES(x86)%\Reference  Assemblies\Microsoft\Framework\MonoTouch\v4.0\*.*?
Comment 19 Jose Miguel Torres 2013-09-13 06:00:41 UTC
BTW, are you using a physical device or emulators?
Comment 20 Doug G 2013-09-13 10:08:55 UTC
I'm attempting to build to an iPod. The iOS simulator is working fine. Attached is a screenshot of the folder you asked for.
Comment 21 Doug G 2013-09-13 10:09:37 UTC
Created attachment 4866 [details]
Files in C:\Program Files (x86)\Reference Assemblies\Microsoft\Framework\MonoTouch\v4.0
Comment 22 Miguel de Icaza [MSFT] 2013-09-16 10:43:58 UTC
Hello guys,

Could we get the project that you are trying to build to help us accelerate the fix?
Comment 23 Michael James 2013-09-16 10:51:03 UTC
Created attachment 4899 [details]
Hello World App that had the issue in August

I emailed this project in August to support@ , it had the same AOT issue.

I will be able to check the Mac file sync side when I'm back in the office tomorrow.

If you need my full solution I can try and arrange that and get it building without NuGet :)
Comment 24 Alan McGovern 2013-11-07 19:38:14 UTC
Hi,

There is one thing we'd like to try. It looks like you are building the application off a network share. If that is the case, can you try copying the project to a local directory on your Macs harddrive. Then make sure none of the files are marked 'readonly' and your user has full read/write access to them. If it does not compile from Xamarin Studio after that, please let us know.
Comment 25 Arpit Jha 2015-07-15 02:51:05 UTC
I have checked this issue with XVS 3.11.666 + XI 8.10.3.2 and its works fine at my end.

For Now I am closing this issue.

@calvin, Please feel free to reopen this issue if you are facing again.